Skip to content

Replace .NET 7 target with .NET 8 rc1 #188

Replace .NET 7 target with .NET 8 rc1

Replace .NET 7 target with .NET 8 rc1 #188

GitHub Actions / test results (macos-latest, node18.x, Release) failed Sep 19, 2023 in 0s

test results (macos-latest, node18.x, Release) ❌

Tests failed

Report Passed Failed Skipped Time
test/dotnet6-node18.x-Release/_Mac-1695100558872_2023-09-19_05_19_43.trx 10✅ 31❌ 3⚪ 125s
test/dotnet8-node18.x-Release/_Mac-1695100558872_2023-09-19_05_22_05.trx 62✅ 4❌ 3⚪ 218s

❌ test/dotnet6-node18.x-Release/_Mac-1695100558872_2023-09-19_05_19_43.trx

44 tests were completed in 125s with 10 passed, 31 failed and 3 skipped.

Test suite Passed Failed Skipped Time
Microsoft.JavaScript.NodeApi.Test.HostedClrTests 1✅ 27❌ 36s
Microsoft.JavaScript.NodeApi.Test.JSProjectTests 4❌ 82s
Microsoft.JavaScript.NodeApi.Test.NodejsEmbeddingTests 3⚪ 3ms
Microsoft.JavaScript.NodeApi.Test.TypeDefsGeneratorTests 9✅ 112ms

❌ Microsoft.JavaScript.NodeApi.Test.HostedClrTests

❌ Test(id: "edgejs-perf/measure-latency")
	Assert.Fail(): Node process exited with code: 134. 
	Unhandled exception. System.DllNotFoundException: Unable to load shared library 'libdl.so' or one of its dependencies. In order to help diagnose loading problems, consider setting the DYLD_PRINT_LIBRARIES environment variable: dlopen(liblibdl.so, 0x0001): tried: 'liblibdl.so' (no such file), '/usr/local/lib/liblibdl.so' (no such file), '/usr/lib/liblibdl.so' (no such file), '/Users/runner/work/node-api-dotnet/node-api-dotnet/out/obj/Release/TestCases/edgejs-perf/net6.0/liblibdl.so' (no such file)
	   at Microsoft.JavaScript.NodeApi.NativeLibrary.dlopen1(IntPtr fileName, Int32 flags)
	   at Microsoft.JavaScript.NodeApi.NativeLibrary.dlopen(IntPtr fileName, Int32 flags) in /Users/runner/work/node-api-dotnet/node-api-dotnet/src/NodeApi/Native/NativeLibrary.cs:line 98
	   at Microsoft.JavaScript.NodeApi.NativeLibrary.GetMainProgramHandle() in /Users/runner/work/node-api-dotnet/node-api-dotnet/src/NodeApi/Native/NativeLibrary.cs:line 35
	   at Microsoft.JavaScript.NodeApi.JSNativeApi.Interop.Initialize(IntPtr libraryHandle) in /Users/runner/work/node-api-dotnet/node-api-dotnet/src/NodeApi/Native/JSNativeApi.Interop.cs:line 31
	   at Microsoft.JavaScript.NodeApi.Interop.JSRuntimeContext..ctor(napi_env env) in /Users/runner/work/node-api-dotnet/node-api-dotnet/src/NodeApi/Interop/JSRuntimeContext.cs:line 120
	   at Microsoft.JavaScript.NodeApi.JSValueScope..ctor(JSValueScopeType scopeType, napi_env env) in /Users/runner/work/node-api-dotnet/node-api-dotnet/src/NodeApi/JSValueScope.cs:line 94
	   at Microsoft.JavaScript.NodeApi.DotNetHost.ManagedHost.InitializeModule(napi_env env, napi_value exports) in /Users/runner/work/node-api-dotnet/node-api-dotnet/src/NodeApi.DotNetHost/ManagedHost.cs:line 204
	
	Full output: /Users/runner/work/node-api-dotnet/node-api-dotnet/out/obj/Release/TestCases/edgejs-perf/net6.0/hosted-measure-latency.log
❌ Test(id: "napi-dotnet-init/custom_export")
	Assert.Fail(): Node process exited with code: 134. 
	Unhandled exception. System.DllNotFoundException: Unable to load shared library 'libdl.so' or one of its dependencies. In order to help diagnose loading problems, consider setting the DYLD_PRINT_LIBRARIES environment variable: dlopen(liblibdl.so, 0x0001): tried: 'liblibdl.so' (no such file), '/usr/local/lib/liblibdl.so' (no such file), '/usr/lib/liblibdl.so' (no such file), '/Users/runner/work/node-api-dotnet/node-api-dotnet/out/obj/Release/TestCases/napi-dotnet-init/net6.0/liblibdl.so' (no such file)
	   at Microsoft.JavaScript.NodeApi.NativeLibrary.dlopen1(IntPtr fileName, Int32 flags)
	   at Microsoft.JavaScript.NodeApi.NativeLibrary.dlopen(IntPtr fileName, Int32 flags) in /Users/runner/work/node-api-dotnet/node-api-dotnet/src/NodeApi/Native/NativeLibrary.cs:line 98
	   at Microsoft.JavaScript.NodeApi.NativeLibrary.GetMainProgramHandle() in /Users/runner/work/node-api-dotnet/node-api-dotnet/src/NodeApi/Native/NativeLibrary.cs:line 35
	   at Microsoft.JavaScript.NodeApi.JSNativeApi.Interop.Initialize(IntPtr libraryHandle) in /Users/runner/work/node-api-dotnet/node-api-dotnet/src/NodeApi/Native/JSNativeApi.Interop.cs:line 31
	   at Microsoft.JavaScript.NodeApi.Interop.JSRuntimeContext..ctor(napi_env env) in /Users/runner/work/node-api-dotnet/node-api-dotnet/src/NodeApi/Interop/JSRuntimeContext.cs:line 120
	   at Microsoft.JavaScript.NodeApi.JSValueScope..ctor(JSValueScopeType scopeType, napi_env env) in /Users/runner/work/node-api-dotnet/node-api-dotnet/src/NodeApi/JSValueScope.cs:line 94
	   at Microsoft.JavaScript.NodeApi.DotNetHost.ManagedHost.InitializeModule(napi_env env, napi_value exports) in /Users/runner/work/node-api-dotnet/node-api-dotnet/src/NodeApi.DotNetHost/ManagedHost.cs:line 204
	
	Full output: /Users/runner/work/node-api-dotnet/node-api-dotnet/out/obj/Release/TestCases/napi-dotnet-init/net6.0/hosted-custom_export.log
❌ Test(id: "napi-dotnet-init/custom_init")
	Assert.Fail(): Node process exited with code: 134. 
	Unhandled exception. System.DllNotFoundException: Unable to load shared library 'libdl.so' or one of its dependencies. In order to help diagnose loading problems, consider setting the DYLD_PRINT_LIBRARIES environment variable: dlopen(liblibdl.so, 0x0001): tried: 'liblibdl.so' (no such file), '/usr/local/lib/liblibdl.so' (no such file), '/usr/lib/liblibdl.so' (no such file), '/Users/runner/work/node-api-dotnet/node-api-dotnet/out/obj/Release/TestCases/napi-dotnet-init/net6.0/liblibdl.so' (no such file)
	   at Microsoft.JavaScript.NodeApi.NativeLibrary.dlopen1(IntPtr fileName, Int32 flags)
	   at Microsoft.JavaScript.NodeApi.NativeLibrary.dlopen(IntPtr fileName, Int32 flags) in /Users/runner/work/node-api-dotnet/node-api-dotnet/src/NodeApi/Native/NativeLibrary.cs:line 98
	   at Microsoft.JavaScript.NodeApi.NativeLibrary.GetMainProgramHandle() in /Users/runner/work/node-api-dotnet/node-api-dotnet/src/NodeApi/Native/NativeLibrary.cs:line 35
	   at Microsoft.JavaScript.NodeApi.JSNativeApi.Interop.Initialize(IntPtr libraryHandle) in /Users/runner/work/node-api-dotnet/node-api-dotnet/src/NodeApi/Native/JSNativeApi.Interop.cs:line 31
	   at Microsoft.JavaScript.NodeApi.Interop.JSRuntimeContext..ctor(napi_env env) in /Users/runner/work/node-api-dotnet/node-api-dotnet/src/NodeApi/Interop/JSRuntimeContext.cs:line 120
	   at Microsoft.JavaScript.NodeApi.JSValueScope..ctor(JSValueScopeType scopeType, napi_env env) in /Users/runner/work/node-api-dotnet/node-api-dotnet/src/NodeApi/JSValueScope.cs:line 94
	   at Microsoft.JavaScript.NodeApi.DotNetHost.ManagedHost.InitializeModule(napi_env env, napi_value exports) in /Users/runner/work/node-api-dotnet/node-api-dotnet/src/NodeApi.DotNetHost/ManagedHost.cs:line 204
	
	Full output: /Users/runner/work/node-api-dotnet/node-api-dotnet/out/obj/Release/TestCases/napi-dotnet-init/net6.0/hosted-custom_init.log
❌ Test(id: "napi-dotnet/async_methods")
	Assert.Fail(): Node process exited with code: 134. 
	Unhandled exception. System.DllNotFoundException: Unable to load shared library 'libdl.so' or one of its dependencies. In order to help diagnose loading problems, consider setting the DYLD_PRINT_LIBRARIES environment variable: dlopen(liblibdl.so, 0x0001): tried: 'liblibdl.so' (no such file), '/usr/local/lib/liblibdl.so' (no such file), '/usr/lib/liblibdl.so' (no such file), '/Users/runner/work/node-api-dotnet/node-api-dotnet/out/obj/Release/TestCases/napi-dotnet/net6.0/liblibdl.so' (no such file)
	   at Microsoft.JavaScript.NodeApi.NativeLibrary.dlopen1(IntPtr fileName, Int32 flags)
	   at Microsoft.JavaScript.NodeApi.NativeLibrary.dlopen(IntPtr fileName, Int32 flags) in /Users/runner/work/node-api-dotnet/node-api-dotnet/src/NodeApi/Native/NativeLibrary.cs:line 98
	   at Microsoft.JavaScript.NodeApi.NativeLibrary.GetMainProgramHandle() in /Users/runner/work/node-api-dotnet/node-api-dotnet/src/NodeApi/Native/NativeLibrary.cs:line 35
	   at Microsoft.JavaScript.NodeApi.JSNativeApi.Interop.Initialize(IntPtr libraryHandle) in /Users/runner/work/node-api-dotnet/node-api-dotnet/src/NodeApi/Native/JSNativeApi.Interop.cs:line 31
	   at Microsoft.JavaScript.NodeApi.Interop.JSRuntimeContext..ctor(napi_env env) in /Users/runner/work/node-api-dotnet/node-api-dotnet/src/NodeApi/Interop/JSRuntimeContext.cs:line 120
	   at Microsoft.JavaScript.NodeApi.JSValueScope..ctor(JSValueScopeType scopeType, napi_env env) in /Users/runner/work/node-api-dotnet/node-api-dotnet/src/NodeApi/JSValueScope.cs:line 94
	   at Microsoft.JavaScript.NodeApi.DotNetHost.ManagedHost.InitializeModule(napi_env env, napi_value exports) in /Users/runner/work/node-api-dotnet/node-api-dotnet/src/NodeApi.DotNetHost/ManagedHost.cs:line 204
	
	Full output: /Users/runner/work/node-api-dotnet/node-api-dotnet/out/obj/Release/TestCases/napi-dotnet/net6.0/hosted-async_methods.log
❌ Test(id: "napi-dotnet/complex_types")
	Assert.Fail(): Node process exited with code: 134. 
	Unhandled exception. System.DllNotFoundException: Unable to load shared library 'libdl.so' or one of its dependencies. In order to help diagnose loading problems, consider setting the DYLD_PRINT_LIBRARIES environment variable: dlopen(liblibdl.so, 0x0001): tried: 'liblibdl.so' (no such file), '/usr/local/lib/liblibdl.so' (no such file), '/usr/lib/liblibdl.so' (no such file), '/Users/runner/work/node-api-dotnet/node-api-dotnet/out/obj/Release/TestCases/napi-dotnet/net6.0/liblibdl.so' (no such file)
	   at Microsoft.JavaScript.NodeApi.NativeLibrary.dlopen1(IntPtr fileName, Int32 flags)
	   at Microsoft.JavaScript.NodeApi.NativeLibrary.dlopen(IntPtr fileName, Int32 flags) in /Users/runner/work/node-api-dotnet/node-api-dotnet/src/NodeApi/Native/NativeLibrary.cs:line 98
	   at Microsoft.JavaScript.NodeApi.NativeLibrary.GetMainProgramHandle() in /Users/runner/work/node-api-dotnet/node-api-dotnet/src/NodeApi/Native/NativeLibrary.cs:line 35
	   at Microsoft.JavaScript.NodeApi.JSNativeApi.Interop.Initialize(IntPtr libraryHandle) in /Users/runner/work/node-api-dotnet/node-api-dotnet/src/NodeApi/Native/JSNativeApi.Interop.cs:line 31
	   at Microsoft.JavaScript.NodeApi.Interop.JSRuntimeContext..ctor(napi_env env) in /Users/runner/work/node-api-dotnet/node-api-dotnet/src/NodeApi/Interop/JSRuntimeContext.cs:line 120
	   at Microsoft.JavaScript.NodeApi.JSValueScope..ctor(JSValueScopeType scopeType, napi_env env) in /Users/runner/work/node-api-dotnet/node-api-dotnet/src/NodeApi/JSValueScope.cs:line 94
	   at Microsoft.JavaScript.NodeApi.DotNetHost.ManagedHost.InitializeModule(napi_env env, napi_value exports) in /Users/runner/work/node-api-dotnet/node-api-dotnet/src/NodeApi.DotNetHost/ManagedHost.cs:line 204
	
	Full output: /Users/runner/work/node-api-dotnet/node-api-dotnet/out/obj/Release/TestCases/napi-dotnet/net6.0/hosted-complex_types.log
❌ Test(id: "napi-dotnet/delegates")
	Assert.Fail(): Node process exited with code: 134. 
	Unhandled exception. System.DllNotFoundException: Unable to load shared library 'libdl.so' or one of its dependencies. In order to help diagnose loading problems, consider setting the DYLD_PRINT_LIBRARIES environment variable: dlopen(liblibdl.so, 0x0001): tried: 'liblibdl.so' (no such file), '/usr/local/lib/liblibdl.so' (no such file), '/usr/lib/liblibdl.so' (no such file), '/Users/runner/work/node-api-dotnet/node-api-dotnet/out/obj/Release/TestCases/napi-dotnet/net6.0/liblibdl.so' (no such file)
	   at Microsoft.JavaScript.NodeApi.NativeLibrary.dlopen1(IntPtr fileName, Int32 flags)
	   at Microsoft.JavaScript.NodeApi.NativeLibrary.dlopen(IntPtr fileName, Int32 flags) in /Users/runner/work/node-api-dotnet/node-api-dotnet/src/NodeApi/Native/NativeLibrary.cs:line 98
	   at Microsoft.JavaScript.NodeApi.NativeLibrary.GetMainProgramHandle() in /Users/runner/work/node-api-dotnet/node-api-dotnet/src/NodeApi/Native/NativeLibrary.cs:line 35
	   at Microsoft.JavaScript.NodeApi.JSNativeApi.Interop.Initialize(IntPtr libraryHandle) in /Users/runner/work/node-api-dotnet/node-api-dotnet/src/NodeApi/Native/JSNativeApi.Interop.cs:line 31
	   at Microsoft.JavaScript.NodeApi.Interop.JSRuntimeContext..ctor(napi_env env) in /Users/runner/work/node-api-dotnet/node-api-dotnet/src/NodeApi/Interop/JSRuntimeContext.cs:line 120
	   at Microsoft.JavaScript.NodeApi.JSValueScope..ctor(JSValueScopeType scopeType, napi_env env) in /Users/runner/work/node-api-dotnet/node-api-dotnet/src/NodeApi/JSValueScope.cs:line 94
	   at Microsoft.JavaScript.NodeApi.DotNetHost.ManagedHost.InitializeModule(napi_env env, napi_value exports) in /Users/runner/work/node-api-dotnet/node-api-dotnet/src/NodeApi.DotNetHost/ManagedHost.cs:line 204
	
	Full output: /Users/runner/work/node-api-dotnet/node-api-dotnet/out/obj/Release/TestCases/napi-dotnet/net6.0/hosted-delegates.log
❌ Test(id: "napi-dotnet/dynamic_generics")
	Assert.Fail(): Node process exited with code: 134. 
	Unhandled exception. System.DllNotFoundException: Unable to load shared library 'libdl.so' or one of its dependencies. In order to help diagnose loading problems, consider setting the DYLD_PRINT_LIBRARIES environment variable: dlopen(liblibdl.so, 0x0001): tried: 'liblibdl.so' (no such file), '/usr/local/lib/liblibdl.so' (no such file), '/usr/lib/liblibdl.so' (no such file), '/Users/runner/work/node-api-dotnet/node-api-dotnet/out/obj/Release/TestCases/napi-dotnet/net6.0/liblibdl.so' (no such file)
	   at Microsoft.JavaScript.NodeApi.NativeLibrary.dlopen1(IntPtr fileName, Int32 flags)
	   at Microsoft.JavaScript.NodeApi.NativeLibrary.dlopen(IntPtr fileName, Int32 flags) in /Users/runner/work/node-api-dotnet/node-api-dotnet/src/NodeApi/Native/NativeLibrary.cs:line 98
	   at Microsoft.JavaScript.NodeApi.NativeLibrary.GetMainProgramHandle() in /Users/runner/work/node-api-dotnet/node-api-dotnet/src/NodeApi/Native/NativeLibrary.cs:line 35
	   at Microsoft.JavaScript.NodeApi.JSNativeApi.Interop.Initialize(IntPtr libraryHandle) in /Users/runner/work/node-api-dotnet/node-api-dotnet/src/NodeApi/Native/JSNativeApi.Interop.cs:line 31
	   at Microsoft.JavaScript.NodeApi.Interop.JSRuntimeContext..ctor(napi_env env) in /Users/runner/work/node-api-dotnet/node-api-dotnet/src/NodeApi/Interop/JSRuntimeContext.cs:line 120
	   at Microsoft.JavaScript.NodeApi.JSValueScope..ctor(JSValueScopeType scopeType, napi_env env) in /Users/runner/work/node-api-dotnet/node-api-dotnet/src/NodeApi/JSValueScope.cs:line 94
	   at Microsoft.JavaScript.NodeApi.DotNetHost.ManagedHost.InitializeModule(napi_env env, napi_value exports) in /Users/runner/work/node-api-dotnet/node-api-dotnet/src/NodeApi.DotNetHost/ManagedHost.cs:line 204
	
	Full output: /Users/runner/work/node-api-dotnet/node-api-dotnet/out/obj/Release/TestCases/napi-dotnet/net6.0/hosted-dynamic_generics.log
❌ Test(id: "napi-dotnet/dynamic_invoke")
	Assert.Fail(): Node process exited with code: 134. 
	Unhandled exception. System.DllNotFoundException: Unable to load shared library 'libdl.so' or one of its dependencies. In order to help diagnose loading problems, consider setting the DYLD_PRINT_LIBRARIES environment variable: dlopen(liblibdl.so, 0x0001): tried: 'liblibdl.so' (no such file), '/usr/local/lib/liblibdl.so' (no such file), '/usr/lib/liblibdl.so' (no such file), '/Users/runner/work/node-api-dotnet/node-api-dotnet/out/obj/Release/TestCases/napi-dotnet/net6.0/liblibdl.so' (no such file)
	   at Microsoft.JavaScript.NodeApi.NativeLibrary.dlopen1(IntPtr fileName, Int32 flags)
	   at Microsoft.JavaScript.NodeApi.NativeLibrary.dlopen(IntPtr fileName, Int32 flags) in /Users/runner/work/node-api-dotnet/node-api-dotnet/src/NodeApi/Native/NativeLibrary.cs:line 98
	   at Microsoft.JavaScript.NodeApi.NativeLibrary.GetMainProgramHandle() in /Users/runner/work/node-api-dotnet/node-api-dotnet/src/NodeApi/Native/NativeLibrary.cs:line 35
	   at Microsoft.JavaScript.NodeApi.JSNativeApi.Interop.Initialize(IntPtr libraryHandle) in /Users/runner/work/node-api-dotnet/node-api-dotnet/src/NodeApi/Native/JSNativeApi.Interop.cs:line 31
	   at Microsoft.JavaScript.NodeApi.Interop.JSRuntimeContext..ctor(napi_env env) in /Users/runner/work/node-api-dotnet/node-api-dotnet/src/NodeApi/Interop/JSRuntimeContext.cs:line 120
	   at Microsoft.JavaScript.NodeApi.JSValueScope..ctor(JSValueScopeType scopeType, napi_env env) in /Users/runner/work/node-api-dotnet/node-api-dotnet/src/NodeApi/JSValueScope.cs:line 94
	   at Microsoft.JavaScript.NodeApi.DotNetHost.ManagedHost.InitializeModule(napi_env env, napi_value exports) in /Users/runner/work/node-api-dotnet/node-api-dotnet/src/NodeApi.DotNetHost/ManagedHost.cs:line 204
	
	Full output: /Users/runner/work/node-api-dotnet/node-api-dotnet/out/obj/Release/TestCases/napi-dotnet/net6.0/hosted-dynamic_invoke.log
❌ Test(id: "napi-dotnet/dynamic_optional_params")
	Assert.Fail(): Node process exited with code: 134. 
	Unhandled exception. System.DllNotFoundException: Unable to load shared library 'libdl.so' or one of its dependencies. In order to help diagnose loading problems, consider setting the DYLD_PRINT_LIBRARIES environment variable: dlopen(liblibdl.so, 0x0001): tried: 'liblibdl.so' (no such file), '/usr/local/lib/liblibdl.so' (no such file), '/usr/lib/liblibdl.so' (no such file), '/Users/runner/work/node-api-dotnet/node-api-dotnet/out/obj/Release/TestCases/napi-dotnet/net6.0/liblibdl.so' (no such file)
	   at Microsoft.JavaScript.NodeApi.NativeLibrary.dlopen1(IntPtr fileName, Int32 flags)
	   at Microsoft.JavaScript.NodeApi.NativeLibrary.dlopen(IntPtr fileName, Int32 flags) in /Users/runner/work/node-api-dotnet/node-api-dotnet/src/NodeApi/Native/NativeLibrary.cs:line 98
	   at Microsoft.JavaScript.NodeApi.NativeLibrary.GetMainProgramHandle() in /Users/runner/work/node-api-dotnet/node-api-dotnet/src/NodeApi/Native/NativeLibrary.cs:line 35
	   at Microsoft.JavaScript.NodeApi.JSNativeApi.Interop.Initialize(IntPtr libraryHandle) in /Users/runner/work/node-api-dotnet/node-api-dotnet/src/NodeApi/Native/JSNativeApi.Interop.cs:line 31
	   at Microsoft.JavaScript.NodeApi.Interop.JSRuntimeContext..ctor(napi_env env) in /Users/runner/work/node-api-dotnet/node-api-dotnet/src/NodeApi/Interop/JSRuntimeContext.cs:line 120
	   at Microsoft.JavaScript.NodeApi.JSValueScope..ctor(JSValueScopeType scopeType, napi_env env) in /Users/runner/work/node-api-dotnet/node-api-dotnet/src/NodeApi/JSValueScope.cs:line 94
	   at Microsoft.JavaScript.NodeApi.DotNetHost.ManagedHost.InitializeModule(napi_env env, napi_value exports) in /Users/runner/work/node-api-dotnet/node-api-dotnet/src/NodeApi.DotNetHost/ManagedHost.cs:line 204
	
	Full output: /Users/runner/work/node-api-dotnet/node-api-dotnet/out/obj/Release/TestCases/napi-dotnet/net6.0/hosted-dynamic_optional_params.log
❌ Test(id: "napi-dotnet/errors")
	Assert.Fail(): Node process exited with code: 134. 
	Unhandled exception. System.DllNotFoundException: Unable to load shared library 'libdl.so' or one of its dependencies. In order to help diagnose loading problems, consider setting the DYLD_PRINT_LIBRARIES environment variable: dlopen(liblibdl.so, 0x0001): tried: 'liblibdl.so' (no such file), '/usr/local/lib/liblibdl.so' (no such file), '/usr/lib/liblibdl.so' (no such file), '/Users/runner/work/node-api-dotnet/node-api-dotnet/out/obj/Release/TestCases/napi-dotnet/net6.0/liblibdl.so' (no such file)
	   at Microsoft.JavaScript.NodeApi.NativeLibrary.dlopen1(IntPtr fileName, Int32 flags)
	   at Microsoft.JavaScript.NodeApi.NativeLibrary.dlopen(IntPtr fileName, Int32 flags) in /Users/runner/work/node-api-dotnet/node-api-dotnet/src/NodeApi/Native/NativeLibrary.cs:line 98
	   at Microsoft.JavaScript.NodeApi.NativeLibrary.GetMainProgramHandle() in /Users/runner/work/node-api-dotnet/node-api-dotnet/src/NodeApi/Native/NativeLibrary.cs:line 35
	   at Microsoft.JavaScript.NodeApi.JSNativeApi.Interop.Initialize(IntPtr libraryHandle) in /Users/runner/work/node-api-dotnet/node-api-dotnet/src/NodeApi/Native/JSNativeApi.Interop.cs:line 31
	   at Microsoft.JavaScript.NodeApi.Interop.JSRuntimeContext..ctor(napi_env env) in /Users/runner/work/node-api-dotnet/node-api-dotnet/src/NodeApi/Interop/JSRuntimeContext.cs:line 120
	   at Microsoft.JavaScript.NodeApi.JSValueScope..ctor(JSValueScopeType scopeType, napi_env env) in /Users/runner/work/node-api-dotnet/node-api-dotnet/src/NodeApi/JSValueScope.cs:line 94
	   at Microsoft.JavaScript.NodeApi.DotNetHost.ManagedHost.InitializeModule(napi_env env, napi_value exports) in /Users/runner/work/node-api-dotnet/node-api-dotnet/src/NodeApi.DotNetHost/ManagedHost.cs:line 204
	
	Full output: /Users/runner/work/node-api-dotnet/node-api-dotnet/out/obj/Release/TestCases/napi-dotnet/net6.0/hosted-errors.log
❌ Test(id: "napi-dotnet/hello")
	Assert.Fail(): Node process exited with code: 134. 
	Unhandled exception. System.DllNotFoundException: Unable to load shared library 'libdl.so' or one of its dependencies. In order to help diagnose loading problems, consider setting the DYLD_PRINT_LIBRARIES environment variable: dlopen(liblibdl.so, 0x0001): tried: 'liblibdl.so' (no such file), '/usr/local/lib/liblibdl.so' (no such file), '/usr/lib/liblibdl.so' (no such file), '/Users/runner/work/node-api-dotnet/node-api-dotnet/out/obj/Release/TestCases/napi-dotnet/net6.0/liblibdl.so' (no such file)
	   at Microsoft.JavaScript.NodeApi.NativeLibrary.dlopen1(IntPtr fileName, Int32 flags)
	   at Microsoft.JavaScript.NodeApi.NativeLibrary.dlopen(IntPtr fileName, Int32 flags) in /Users/runner/work/node-api-dotnet/node-api-dotnet/src/NodeApi/Native/NativeLibrary.cs:line 98
	   at Microsoft.JavaScript.NodeApi.NativeLibrary.GetMainProgramHandle() in /Users/runner/work/node-api-dotnet/node-api-dotnet/src/NodeApi/Native/NativeLibrary.cs:line 35
	   at Microsoft.JavaScript.NodeApi.JSNativeApi.Interop.Initialize(IntPtr libraryHandle) in /Users/runner/work/node-api-dotnet/node-api-dotnet/src/NodeApi/Native/JSNativeApi.Interop.cs:line 31
	   at Microsoft.JavaScript.NodeApi.Interop.JSRuntimeContext..ctor(napi_env env) in /Users/runner/work/node-api-dotnet/node-api-dotnet/src/NodeApi/Interop/JSRuntimeContext.cs:line 120
	   at Microsoft.JavaScript.NodeApi.JSValueScope..ctor(JSValueScopeType scopeType, napi_env env) in /Users/runner/work/node-api-dotnet/node-api-dotnet/src/NodeApi/JSValueScope.cs:line 94
	   at Microsoft.JavaScript.NodeApi.DotNetHost.ManagedHost.InitializeModule(napi_env env, napi_value exports) in /Users/runner/work/node-api-dotnet/node-api-dotnet/src/NodeApi.DotNetHost/ManagedHost.cs:line 204
	
	Full output: /Users/runner/work/node-api-dotnet/node-api-dotnet/out/obj/Release/TestCases/napi-dotnet/net6.0/hosted-hello.log
❌ Test(id: "napi-dotnet/module_class")
	Assert.Fail(): Node process exited with code: 134. 
	Unhandled exception. System.DllNotFoundException: Unable to load shared library 'libdl.so' or one of its dependencies. In order to help diagnose loading problems, consider setting the DYLD_PRINT_LIBRARIES environment variable: dlopen(liblibdl.so, 0x0001): tried: 'liblibdl.so' (no such file), '/usr/local/lib/liblibdl.so' (no such file), '/usr/lib/liblibdl.so' (no such file), '/Users/runner/work/node-api-dotnet/node-api-dotnet/out/obj/Release/TestCases/napi-dotnet/net6.0/liblibdl.so' (no such file)
	   at Microsoft.JavaScript.NodeApi.NativeLibrary.dlopen1(IntPtr fileName, Int32 flags)
	   at Microsoft.JavaScript.NodeApi.NativeLibrary.dlopen(IntPtr fileName, Int32 flags) in /Users/runner/work/node-api-dotnet/node-api-dotnet/src/NodeApi/Native/NativeLibrary.cs:line 98
	   at Microsoft.JavaScript.NodeApi.NativeLibrary.GetMainProgramHandle() in /Users/runner/work/node-api-dotnet/node-api-dotnet/src/NodeApi/Native/NativeLibrary.cs:line 35
	   at Microsoft.JavaScript.NodeApi.JSNativeApi.Interop.Initialize(IntPtr libraryHandle) in /Users/runner/work/node-api-dotnet/node-api-dotnet/src/NodeApi/Native/JSNativeApi.Interop.cs:line 31
	   at Microsoft.JavaScript.NodeApi.Interop.JSRuntimeContext..ctor(napi_env env) in /Users/runner/work/node-api-dotnet/node-api-dotnet/src/NodeApi/Interop/JSRuntimeContext.cs:line 120
	   at Microsoft.JavaScript.NodeApi.JSValueScope..ctor(JSValueScopeType scopeType, napi_env env) in /Users/runner/work/node-api-dotnet/node-api-dotnet/src/NodeApi/JSValueScope.cs:line 94
	   at Microsoft.JavaScript.NodeApi.DotNetHost.ManagedHost.InitializeModule(napi_env env, napi_value exports) in /Users/runner/work/node-api-dotnet/node-api-dotnet/src/NodeApi.DotNetHost/ManagedHost.cs:line 204
	
	Full output: /Users/runner/work/node-api-dotnet/node-api-dotnet/out/obj/Release/TestCases/napi-dotnet/net6.0/hosted-module_class.log
❌ Test(id: "napi-dotnet/multi_instance")
	Assert.Fail(): Node process exited with code: 134. 
	Unhandled exception. System.DllNotFoundException: Unable to load shared library 'libdl.so' or one of its dependencies. In order to help diagnose loading problems, consider setting the DYLD_PRINT_LIBRARIES environment variable: dlopen(liblibdl.so, 0x0001): tried: 'liblibdl.so' (no such file), '/usr/local/lib/liblibdl.so' (no such file), '/usr/lib/liblibdl.so' (no such file), '/Users/runner/work/node-api-dotnet/node-api-dotnet/out/obj/Release/TestCases/napi-dotnet/net6.0/liblibdl.so' (no such file)
	   at Microsoft.JavaScript.NodeApi.NativeLibrary.dlopen1(IntPtr fileName, Int32 flags)
	   at Microsoft.JavaScript.NodeApi.NativeLibrary.dlopen(IntPtr fileName, Int32 flags) in /Users/runner/work/node-api-dotnet/node-api-dotnet/src/NodeApi/Native/NativeLibrary.cs:line 98
	   at Microsoft.JavaScript.NodeApi.NativeLibrary.GetMainProgramHandle() in /Users/runner/work/node-api-dotnet/node-api-dotnet/src/NodeApi/Native/NativeLibrary.cs:line 35
	   at Microsoft.JavaScript.NodeApi.JSNativeApi.Interop.Initialize(IntPtr libraryHandle) in /Users/runner/work/node-api-dotnet/node-api-dotnet/src/NodeApi/Native/JSNativeApi.Interop.cs:line 31
	   at Microsoft.JavaScript.NodeApi.Interop.JSRuntimeContext..ctor(napi_env env) in /Users/runner/work/node-api-dotnet/node-api-dotnet/src/NodeApi/Interop/JSRuntimeContext.cs:line 120
	   at Microsoft.JavaScript.NodeApi.JSValueScope..ctor(JSValueScopeType scopeType, napi_env env) in /Users/runner/work/node-api-dotnet/node-api-dotnet/src/NodeApi/JSValueScope.cs:line 94
	   at Microsoft.JavaScript.NodeApi.DotNetHost.ManagedHost.InitializeModule(napi_env env, napi_value exports) in /Users/runner/work/node-api-dotnet/node-api-dotnet/src/NodeApi.DotNetHost/ManagedHost.cs:line 204
	
	Full output: /Users/runner/work/node-api-dotnet/node-api-dotnet/out/obj/Release/TestCases/napi-dotnet/net6.0/hosted-multi_instance.log
❌ Test(id: "napi-dotnet/streams")
	Assert.Fail(): Node process exited with code: 134. 
	Unhandled exception. System.DllNotFoundException: Unable to load shared library 'libdl.so' or one of its dependencies. In order to help diagnose loading problems, consider setting the DYLD_PRINT_LIBRARIES environment variable: dlopen(liblibdl.so, 0x0001): tried: 'liblibdl.so' (no such file), '/usr/local/lib/liblibdl.so' (no such file), '/usr/lib/liblibdl.so' (no such file), '/Users/runner/work/node-api-dotnet/node-api-dotnet/out/obj/Release/TestCases/napi-dotnet/net6.0/liblibdl.so' (no such file)
	   at Microsoft.JavaScript.NodeApi.NativeLibrary.dlopen1(IntPtr fileName, Int32 flags)
	   at Microsoft.JavaScript.NodeApi.NativeLibrary.dlopen(IntPtr fileName, Int32 flags) in /Users/runner/work/node-api-dotnet/node-api-dotnet/src/NodeApi/Native/NativeLibrary.cs:line 98
	   at Microsoft.JavaScript.NodeApi.NativeLibrary.GetMainProgramHandle() in /Users/runner/work/node-api-dotnet/node-api-dotnet/src/NodeApi/Native/NativeLibrary.cs:line 35
	   at Microsoft.JavaScript.NodeApi.JSNativeApi.Interop.Initialize(IntPtr libraryHandle) in /Users/runner/work/node-api-dotnet/node-api-dotnet/src/NodeApi/Native/JSNativeApi.Interop.cs:line 31
	   at Microsoft.JavaScript.NodeApi.Interop.JSRuntimeContext..ctor(napi_env env) in /Users/runner/work/node-api-dotnet/node-api-dotnet/src/NodeApi/Interop/JSRuntimeContext.cs:line 120
	   at Microsoft.JavaScript.NodeApi.JSValueScope..ctor(JSValueScopeType scopeType, napi_env env) in /Users/runner/work/node-api-dotnet/node-api-dotnet/src/NodeApi/JSValueScope.cs:line 94
	   at Microsoft.JavaScript.NodeApi.DotNetHost.ManagedHost.InitializeModule(napi_env env, napi_value exports) in /Users/runner/work/node-api-dotnet/node-api-dotnet/src/NodeApi.DotNetHost/ManagedHost.cs:line 204
	
	Full output: /Users/runner/work/node-api-dotnet/node-api-dotnet/out/obj/Release/TestCases/napi-dotnet/net6.0/hosted-streams.log
❌ Test(id: "node-addon-api/basic_types/array")
	Assert.Fail(): Node process exited with code: 134. 
	Unhandled exception. System.DllNotFoundException: Unable to load shared library 'libdl.so' or one of its dependencies. In order to help diagnose loading problems, consider setting the DYLD_PRINT_LIBRARIES environment variable: dlopen(liblibdl.so, 0x0001): tried: 'liblibdl.so' (no such file), '/usr/local/lib/liblibdl.so' (no such file), '/usr/lib/liblibdl.so' (no such file), '/Users/runner/work/node-api-dotnet/node-api-dotnet/out/obj/Release/TestCases/node-addon-api/net6.0/liblibdl.so' (no such file)
	   at Microsoft.JavaScript.NodeApi.NativeLibrary.dlopen1(IntPtr fileName, Int32 flags)
	   at Microsoft.JavaScript.NodeApi.NativeLibrary.dlopen(IntPtr fileName, Int32 flags) in /Users/runner/work/node-api-dotnet/node-api-dotnet/src/NodeApi/Native/NativeLibrary.cs:line 98
	   at Microsoft.JavaScript.NodeApi.NativeLibrary.GetMainProgramHandle() in /Users/runner/work/node-api-dotnet/node-api-dotnet/src/NodeApi/Native/NativeLibrary.cs:line 35
	   at Microsoft.JavaScript.NodeApi.JSNativeApi.Interop.Initialize(IntPtr libraryHandle) in /Users/runner/work/node-api-dotnet/node-api-dotnet/src/NodeApi/Native/JSNativeApi.Interop.cs:line 31
	   at Microsoft.JavaScript.NodeApi.Interop.JSRuntimeContext..ctor(napi_env env) in /Users/runner/work/node-api-dotnet/node-api-dotnet/src/NodeApi/Interop/JSRuntimeContext.cs:line 120
	   at Microsoft.JavaScript.NodeApi.JSValueScope..ctor(JSValueScopeType scopeType, napi_env env) in /Users/runner/work/node-api-dotnet/node-api-dotnet/src/NodeApi/JSValueScope.cs:line 94
	   at Microsoft.JavaScript.NodeApi.DotNetHost.ManagedHost.InitializeModule(napi_env env, napi_value exports) in /Users/runner/work/node-api-dotnet/node-api-dotnet/src/NodeApi.DotNetHost/ManagedHost.cs:line 204
	
	Full output: /Users/runner/work/node-api-dotnet/node-api-dotnet/out/obj/Release/TestCases/node-addon-api/net6.0/hosted-array.log
❌ Test(id: "node-addon-api/basic_types/boolean")
	Assert.Fail(): Node process exited with code: 134. 
	Unhandled exception. System.DllNotFoundException: Unable to load shared library 'libdl.so' or one of its dependencies. In order to help diagnose loading problems, consider setting the DYLD_PRINT_LIBRARIES environment variable: dlopen(liblibdl.so, 0x0001): tried: 'liblibdl.so' (no such file), '/usr/local/lib/liblibdl.so' (no such file), '/usr/lib/liblibdl.so' (no such file), '/Users/runner/work/node-api-dotnet/node-api-dotnet/out/obj/Release/TestCases/node-addon-api/net6.0/liblibdl.so' (no such file)
	   at Microsoft.JavaScript.NodeApi.NativeLibrary.dlopen1(IntPtr fileName, Int32 flags)
	   at Microsoft.JavaScript.NodeApi.NativeLibrary.dlopen(IntPtr fileName, Int32 flags) in /Users/runner/work/node-api-dotnet/node-api-dotnet/src/NodeApi/Native/NativeLibrary.cs:line 98
	   at Microsoft.JavaScript.NodeApi.NativeLibrary.GetMainProgramHandle() in /Users/runner/work/node-api-dotnet/node-api-dotnet/src/NodeApi/Native/NativeLibrary.cs:line 35
	   at Microsoft.JavaScript.NodeApi.JSNativeApi.Interop.Initialize(IntPtr libraryHandle) in /Users/runner/work/node-api-dotnet/node-api-dotnet/src/NodeApi/Native/JSNativeApi.Interop.cs:line 31
	   at Microsoft.JavaScript.NodeApi.Interop.JSRuntimeContext..ctor(napi_env env) in /Users/runner/work/node-api-dotnet/node-api-dotnet/src/NodeApi/Interop/JSRuntimeContext.cs:line 120
	   at Microsoft.JavaScript.NodeApi.JSValueScope..ctor(JSValueScopeType scopeType, napi_env env) in /Users/runner/work/node-api-dotnet/node-api-dotnet/src/NodeApi/JSValueScope.cs:line 94
	   at Microsoft.JavaScript.NodeApi.DotNetHost.ManagedHost.InitializeModule(napi_env env, napi_value exports) in /Users/runner/work/node-api-dotnet/node-api-dotnet/src/NodeApi.DotNetHost/ManagedHost.cs:line 204
	
	Full output: /Users/runner/work/node-api-dotnet/node-api-dotnet/out/obj/Release/TestCases/node-addon-api/net6.0/hosted-boolean.log
❌ Test(id: "node-addon-api/basic_types/number")
	Assert.Fail(): Node process exited with code: 134. 
	Unhandled exception. System.DllNotFoundException: Unable to load shared library 'libdl.so' or one of its dependencies. In order to help diagnose loading problems, consider setting the DYLD_PRINT_LIBRARIES environment variable: dlopen(liblibdl.so, 0x0001): tried: 'liblibdl.so' (no such file), '/usr/local/lib/liblibdl.so' (no such file), '/usr/lib/liblibdl.so' (no such file), '/Users/runner/work/node-api-dotnet/node-api-dotnet/out/obj/Release/TestCases/node-addon-api/net6.0/liblibdl.so' (no such file)
	   at Microsoft.JavaScript.NodeApi.NativeLibrary.dlopen1(IntPtr fileName, Int32 flags)
	   at Microsoft.JavaScript.NodeApi.NativeLibrary.dlopen(IntPtr fileName, Int32 flags) in /Users/runner/work/node-api-dotnet/node-api-dotnet/src/NodeApi/Native/NativeLibrary.cs:line 98
	   at Microsoft.JavaScript.NodeApi.NativeLibrary.GetMainProgramHandle() in /Users/runner/work/node-api-dotnet/node-api-dotnet/src/NodeApi/Native/NativeLibrary.cs:line 35
	   at Microsoft.JavaScript.NodeApi.JSNativeApi.Interop.Initialize(IntPtr libraryHandle) in /Users/runner/work/node-api-dotnet/node-api-dotnet/src/NodeApi/Native/JSNativeApi.Interop.cs:line 31
	   at Microsoft.JavaScript.NodeApi.Interop.JSRuntimeContext..ctor(napi_env env) in /Users/runner/work/node-api-dotnet/node-api-dotnet/src/NodeApi/Interop/JSRuntimeContext.cs:line 120
	   at Microsoft.JavaScript.NodeApi.JSValueScope..ctor(JSValueScopeType scopeType, napi_env env) in /Users/runner/work/node-api-dotnet/node-api-dotnet/src/NodeApi/JSValueScope.cs:line 94
	   at Microsoft.JavaScript.NodeApi.DotNetHost.ManagedHost.InitializeModule(napi_env env, napi_value exports) in /Users/runner/work/node-api-dotnet/node-api-dotnet/src/NodeApi.DotNetHost/ManagedHost.cs:line 204
	
	Full output: /Users/runner/work/node-api-dotnet/node-api-dotnet/out/obj/Release/TestCases/node-addon-api/net6.0/hosted-number.log
❌ Test(id: "node-addon-api/basic_types/value")
	Assert.Fail(): Node process exited with code: 134. 
	Unhandled exception. System.DllNotFoundException: Unable to load shared library 'libdl.so' or one of its dependencies. In order to help diagnose loading problems, consider setting the DYLD_PRINT_LIBRARIES environment variable: dlopen(liblibdl.so, 0x0001): tried: 'liblibdl.so' (no such file), '/usr/local/lib/liblibdl.so' (no such file), '/usr/lib/liblibdl.so' (no such file), '/Users/runner/work/node-api-dotnet/node-api-dotnet/out/obj/Release/TestCases/node-addon-api/net6.0/liblibdl.so' (no such file)
	   at Microsoft.JavaScript.NodeApi.NativeLibrary.dlopen1(IntPtr fileName, Int32 flags)
	   at Microsoft.JavaScript.NodeApi.NativeLibrary.dlopen(IntPtr fileName, Int32 flags) in /Users/runner/work/node-api-dotnet/node-api-dotnet/src/NodeApi/Native/NativeLibrary.cs:line 98
	   at Microsoft.JavaScript.NodeApi.NativeLibrary.GetMainProgramHandle() in /Users/runner/work/node-api-dotnet/node-api-dotnet/src/NodeApi/Native/NativeLibrary.cs:line 35
	   at Microsoft.JavaScript.NodeApi.JSNativeApi.Interop.Initialize(IntPtr libraryHandle) in /Users/runner/work/node-api-dotnet/node-api-dotnet/src/NodeApi/Native/JSNativeApi.Interop.cs:line 31
	   at Microsoft.JavaScript.NodeApi.Interop.JSRuntimeContext..ctor(napi_env env) in /Users/runner/work/node-api-dotnet/node-api-dotnet/src/NodeApi/Interop/JSRuntimeContext.cs:line 120
	   at Microsoft.JavaScript.NodeApi.JSValueScope..ctor(JSValueScopeType scopeType, napi_env env) in /Users/runner/work/node-api-dotnet/node-api-dotnet/src/NodeApi/JSValueScope.cs:line 94
	   at Microsoft.JavaScript.NodeApi.DotNetHost.ManagedHost.InitializeModule(napi_env env, napi_value exports) in /Users/runner/work/node-api-dotnet/node-api-dotnet/src/NodeApi.DotNetHost/ManagedHost.cs:line 204
	
	Full output: /Users/runner/work/node-api-dotnet/node-api-dotnet/out/obj/Release/TestCases/node-addon-api/net6.0/hosted-value.log
❌ Test(id: "node-addon-api/object/delete_property")
	Assert.Fail(): Node process exited with code: 134. 
	Unhandled exception. System.DllNotFoundException: Unable to load shared library 'libdl.so' or one of its dependencies. In order to help diagnose loading problems, consider setting the DYLD_PRINT_LIBRARIES environment variable: dlopen(liblibdl.so, 0x0001): tried: 'liblibdl.so' (no such file), '/usr/local/lib/liblibdl.so' (no such file), '/usr/lib/liblibdl.so' (no such file), '/Users/runner/work/node-api-dotnet/node-api-dotnet/out/obj/Release/TestCases/node-addon-api/net6.0/liblibdl.so' (no such file)
	   at Microsoft.JavaScript.NodeApi.NativeLibrary.dlopen1(IntPtr fileName, Int32 flags)
	   at Microsoft.JavaScript.NodeApi.NativeLibrary.dlopen(IntPtr fileName, Int32 flags) in /Users/runner/work/node-api-dotnet/node-api-dotnet/src/NodeApi/Native/NativeLibrary.cs:line 98
	   at Microsoft.JavaScript.NodeApi.NativeLibrary.GetMainProgramHandle() in /Users/runner/work/node-api-dotnet/node-api-dotnet/src/NodeApi/Native/NativeLibrary.cs:line 35
	   at Microsoft.JavaScript.NodeApi.JSNativeApi.Interop.Initialize(IntPtr libraryHandle) in /Users/runner/work/node-api-dotnet/node-api-dotnet/src/NodeApi/Native/JSNativeApi.Interop.cs:line 31
	   at Microsoft.JavaScript.NodeApi.Interop.JSRuntimeContext..ctor(napi_env env) in /Users/runner/work/node-api-dotnet/node-api-dotnet/src/NodeApi/Interop/JSRuntimeContext.cs:line 120
	   at Microsoft.JavaScript.NodeApi.JSValueScope..ctor(JSValueScopeType scopeType, napi_env env) in /Users/runner/work/node-api-dotnet/node-api-dotnet/src/NodeApi/JSValueScope.cs:line 94
	   at Microsoft.JavaScript.NodeApi.DotNetHost.ManagedHost.InitializeModule(napi_env env, napi_value exports) in /Users/runner/work/node-api-dotnet/node-api-dotnet/src/NodeApi.DotNetHost/ManagedHost.cs:line 204
	
	Full output: /Users/runner/work/node-api-dotnet/node-api-dotnet/out/obj/Release/TestCases/node-addon-api/net6.0/hosted-delete_property.log
❌ Test(id: "node-addon-api/object/finalizer")
	Assert.Fail(): Node process exited with code: 134. 
	Unhandled exception. System.DllNotFoundException: Unable to load shared library 'libdl.so' or one of its dependencies. In order to help diagnose loading problems, consider setting the DYLD_PRINT_LIBRARIES environment variable: dlopen(liblibdl.so, 0x0001): tried: 'liblibdl.so' (no such file), '/usr/local/lib/liblibdl.so' (no such file), '/usr/lib/liblibdl.so' (no such file), '/Users/runner/work/node-api-dotnet/node-api-dotnet/out/obj/Release/TestCases/node-addon-api/net6.0/liblibdl.so' (no such file)
	   at Microsoft.JavaScript.NodeApi.NativeLibrary.dlopen1(IntPtr fileName, Int32 flags)
	   at Microsoft.JavaScript.NodeApi.NativeLibrary.dlopen(IntPtr fileName, Int32 flags) in /Users/runner/work/node-api-dotnet/node-api-dotnet/src/NodeApi/Native/NativeLibrary.cs:line 98
	   at Microsoft.JavaScript.NodeApi.NativeLibrary.GetMainProgramHandle() in /Users/runner/work/node-api-dotnet/node-api-dotnet/src/NodeApi/Native/NativeLibrary.cs:line 35
	   at Microsoft.JavaScript.NodeApi.JSNativeApi.Interop.Initialize(IntPtr libraryHandle) in /Users/runner/work/node-api-dotnet/node-api-dotnet/src/NodeApi/Native/JSNativeApi.Interop.cs:line 31
	   at Microsoft.JavaScript.NodeApi.Interop.JSRuntimeContext..ctor(napi_env env) in /Users/runner/work/node-api-dotnet/node-api-dotnet/src/NodeApi/Interop/JSRuntimeContext.cs:line 120
	   at Microsoft.JavaScript.NodeApi.JSValueScope..ctor(JSValueScopeType scopeType, napi_env env) in /Users/runner/work/node-api-dotnet/node-api-dotnet/src/NodeApi/JSValueScope.cs:line 94
	   at Microsoft.JavaScript.NodeApi.DotNetHost.ManagedHost.InitializeModule(napi_env env, napi_value exports) in /Users/runner/work/node-api-dotnet/node-api-dotnet/src/NodeApi.DotNetHost/ManagedHost.cs:line 204
	
	Full output: /Users/runner/work/node-api-dotnet/node-api-dotnet/out/obj/Release/TestCases/node-addon-api/net6.0/hosted-finalizer.log
❌ Test(id: "node-addon-api/object/get_property")
	Assert.Fail(): Node process exited with code: 134. 
	Unhandled exception. System.DllNotFoundException: Unable to load shared library 'libdl.so' or one of its dependencies. In order to help diagnose loading problems, consider setting the DYLD_PRINT_LIBRARIES environment variable: dlopen(liblibdl.so, 0x0001): tried: 'liblibdl.so' (no such file), '/usr/local/lib/liblibdl.so' (no such file), '/usr/lib/liblibdl.so' (no such file), '/Users/runner/work/node-api-dotnet/node-api-dotnet/out/obj/Release/TestCases/node-addon-api/net6.0/liblibdl.so' (no such file)
	   at Microsoft.JavaScript.NodeApi.NativeLibrary.dlopen1(IntPtr fileName, Int32 flags)
	   at Microsoft.JavaScript.NodeApi.NativeLibrary.dlopen(IntPtr fileName, Int32 flags) in /Users/runner/work/node-api-dotnet/node-api-dotnet/src/NodeApi/Native/NativeLibrary.cs:line 98
	   at Microsoft.JavaScript.NodeApi.NativeLibrary.GetMainProgramHandle() in /Users/runner/work/node-api-dotnet/node-api-dotnet/src/NodeApi/Native/NativeLibrary.cs:line 35
	   at Microsoft.JavaScript.NodeApi.JSNativeApi.Interop.Initialize(IntPtr libraryHandle) in /Users/runner/work/node-api-dotnet/node-api-dotnet/src/NodeApi/Native/JSNativeApi.Interop.cs:line 31
	   at Microsoft.JavaScript.NodeApi.Interop.JSRuntimeContext..ctor(napi_env env) in /Users/runner/work/node-api-dotnet/node-api-dotnet/src/NodeApi/Interop/JSRuntimeContext.cs:line 120
	   at Microsoft.JavaScript.NodeApi.JSValueScope..ctor(JSValueScopeType scopeType, napi_env env) in /Users/runner/work/node-api-dotnet/node-api-dotnet/src/NodeApi/JSValueScope.cs:line 94
	   at Microsoft.JavaScript.NodeApi.DotNetHost.ManagedHost.InitializeModule(napi_env env, napi_value exports) in /Users/runner/work/node-api-dotnet/node-api-dotnet/src/NodeApi.DotNetHost/ManagedHost.cs:line 204
	
	Full output: /Users/runner/work/node-api-dotnet/node-api-dotnet/out/obj/Release/TestCases/node-addon-api/net6.0/hosted-get_property.log
❌ Test(id: "node-addon-api/object/has_own_property")
	Assert.Fail(): Node process exited with code: 134. 
	Unhandled exception. System.DllNotFoundException: Unable to load shared library 'libdl.so' or one of its dependencies. In order to help diagnose loading problems, consider setting the DYLD_PRINT_LIBRARIES environment variable: dlopen(liblibdl.so, 0x0001): tried: 'liblibdl.so' (no such file), '/usr/local/lib/liblibdl.so' (no such file), '/usr/lib/liblibdl.so' (no such file), '/Users/runner/work/node-api-dotnet/node-api-dotnet/out/obj/Release/TestCases/node-addon-api/net6.0/liblibdl.so' (no such file)
	   at Microsoft.JavaScript.NodeApi.NativeLibrary.dlopen1(IntPtr fileName, Int32 flags)
	   at Microsoft.JavaScript.NodeApi.NativeLibrary.dlopen(IntPtr fileName, Int32 flags) in /Users/runner/work/node-api-dotnet/node-api-dotnet/src/NodeApi/Native/NativeLibrary.cs:line 98
	   at Microsoft.JavaScript.NodeApi.NativeLibrary.GetMainProgramHandle() in /Users/runner/work/node-api-dotnet/node-api-dotnet/src/NodeApi/Native/NativeLibrary.cs:line 35
	   at Microsoft.JavaScript.NodeApi.JSNativeApi.Interop.Initialize(IntPtr libraryHandle) in /Users/runner/work/node-api-dotnet/node-api-dotnet/src/NodeApi/Native/JSNativeApi.Interop.cs:line 31
	   at Microsoft.JavaScript.NodeApi.Interop.JSRuntimeContext..ctor(napi_env env) in /Users/runner/work/node-api-dotnet/node-api-dotnet/src/NodeApi/Interop/JSRuntimeContext.cs:line 120
	   at Microsoft.JavaScript.NodeApi.JSValueScope..ctor(JSValueScopeType scopeType, napi_env env) in /Users/runner/work/node-api-dotnet/node-api-dotnet/src/NodeApi/JSValueScope.cs:line 94
	   at Microsoft.JavaScript.NodeApi.DotNetHost.ManagedHost.InitializeModule(napi_env env, napi_value exports) in /Users/runner/work/node-api-dotnet/node-api-dotnet/src/NodeApi.DotNetHost/ManagedHost.cs:line 204
	
	Full output: /Users/runner/work/node-api-dotnet/node-api-dotnet/out/obj/Release/TestCases/node-addon-api/net6.0/hosted-has_own_property.log
❌ Test(id: "node-addon-api/object/has_property")
	Assert.Fail(): Node process exited with code: 134. 
	Unhandled exception. System.DllNotFoundException: Unable to load shared library 'libdl.so' or one of its dependencies. In order to help diagnose loading problems, consider setting the DYLD_PRINT_LIBRARIES environment variable: dlopen(liblibdl.so, 0x0001): tried: 'liblibdl.so' (no such file), '/usr/local/lib/liblibdl.so' (no such file), '/usr/lib/liblibdl.so' (no such file), '/Users/runner/work/node-api-dotnet/node-api-dotnet/out/obj/Release/TestCases/node-addon-api/net6.0/liblibdl.so' (no such file)
	   at Microsoft.JavaScript.NodeApi.NativeLibrary.dlopen1(IntPtr fileName, Int32 flags)
	   at Microsoft.JavaScript.NodeApi.NativeLibrary.dlopen(IntPtr fileName, Int32 flags) in /Users/runner/work/node-api-dotnet/node-api-dotnet/src/NodeApi/Native/NativeLibrary.cs:line 98
	   at Microsoft.JavaScript.NodeApi.NativeLibrary.GetMainProgramHandle() in /Users/runner/work/node-api-dotnet/node-api-dotnet/src/NodeApi/Native/NativeLibrary.cs:line 35
	   at Microsoft.JavaScript.NodeApi.JSNativeApi.Interop.Initialize(IntPtr libraryHandle) in /Users/runner/work/node-api-dotnet/node-api-dotnet/src/NodeApi/Native/JSNativeApi.Interop.cs:line 31
	   at Microsoft.JavaScript.NodeApi.Interop.JSRuntimeContext..ctor(napi_env env) in /Users/runner/work/node-api-dotnet/node-api-dotnet/src/NodeApi/Interop/JSRuntimeContext.cs:line 120
	   at Microsoft.JavaScript.NodeApi.JSValueScope..ctor(JSValueScopeType scopeType, napi_env env) in /Users/runner/work/node-api-dotnet/node-api-dotnet/src/NodeApi/JSValueScope.cs:line 94
	   at Microsoft.JavaScript.NodeApi.DotNetHost.ManagedHost.InitializeModule(napi_env env, napi_value exports) in /Users/runner/work/node-api-dotnet/node-api-dotnet/src/NodeApi.DotNetHost/ManagedHost.cs:line 204
	
	Full output: /Users/runner/work/node-api-dotnet/node-api-dotnet/out/obj/Release/TestCases/node-addon-api/net6.0/hosted-has_property.log
❌ Test(id: "node-addon-api/object/object_freeze_seal")
	Assert.Fail(): Node process exited with code: 134. 
	Unhandled exception. System.DllNotFoundException: Unable to load shared library 'libdl.so' or one of its dependencies. In order to help diagnose loading problems, consider setting the DYLD_PRINT_LIBRARIES environment variable: dlopen(liblibdl.so, 0x0001): tried: 'liblibdl.so' (no such file), '/usr/local/lib/liblibdl.so' (no such file), '/usr/lib/liblibdl.so' (no such file), '/Users/runner/work/node-api-dotnet/node-api-dotnet/out/obj/Release/TestCases/node-addon-api/net6.0/liblibdl.so' (no such file)
	   at Microsoft.JavaScript.NodeApi.NativeLibrary.dlopen1(IntPtr fileName, Int32 flags)
	   at Microsoft.JavaScript.NodeApi.NativeLibrary.dlopen(IntPtr fileName, Int32 flags) in /Users/runner/work/node-api-dotnet/node-api-dotnet/src/NodeApi/Native/NativeLibrary.cs:line 98
	   at Microsoft.JavaScript.NodeApi.NativeLibrary.GetMainProgramHandle() in /Users/runner/work/node-api-dotnet/node-api-dotnet/src/NodeApi/Native/NativeLibrary.cs:line 35
	   at Microsoft.JavaScript.NodeApi.JSNativeApi.Interop.Initialize(IntPtr libraryHandle) in /Users/runner/work/node-api-dotnet/node-api-dotnet/src/NodeApi/Native/JSNativeApi.Interop.cs:line 31
	   at Microsoft.JavaScript.NodeApi.Interop.JSRuntimeContext..ctor(napi_env env) in /Users/runner/work/node-api-dotnet/node-api-dotnet/src/NodeApi/Interop/JSRuntimeContext.cs:line 120
	   at Microsoft.JavaScript.NodeApi.JSValueScope..ctor(JSValueScopeType scopeType, napi_env env) in /Users/runner/work/node-api-dotnet/node-api-dotnet/src/NodeApi/JSValueScope.cs:line 94
	   at Microsoft.JavaScript.NodeApi.DotNetHost.ManagedHost.InitializeModule(napi_env env, napi_value exports) in /Users/runner/work/node-api-dotnet/node-api-dotnet/src/NodeApi.DotNetHost/ManagedHost.cs:line 204
	
	Full output: /Users/runner/work/node-api-dotnet/node-api-dotnet/out/obj/Release/TestCases/node-addon-api/net6.0/hosted-object_freeze_seal.log
❌ Test(id: "node-addon-api/object/object")
	Assert.Fail(): Node process exited with code: 134. 
	Unhandled exception. System.DllNotFoundException: Unable to load shared library 'libdl.so' or one of its dependencies. In order to help diagnose loading problems, consider setting the DYLD_PRINT_LIBRARIES environment variable: dlopen(liblibdl.so, 0x0001): tried: 'liblibdl.so' (no such file), '/usr/local/lib/liblibdl.so' (no such file), '/usr/lib/liblibdl.so' (no such file), '/Users/runner/work/node-api-dotnet/node-api-dotnet/out/obj/Release/TestCases/node-addon-api/net6.0/liblibdl.so' (no such file)
	   at Microsoft.JavaScript.NodeApi.NativeLibrary.dlopen1(IntPtr fileName, Int32 flags)
	   at Microsoft.JavaScript.NodeApi.NativeLibrary.dlopen(IntPtr fileName, Int32 flags) in /Users/runner/work/node-api-dotnet/node-api-dotnet/src/NodeApi/Native/NativeLibrary.cs:line 98
	   at Microsoft.JavaScript.NodeApi.NativeLibrary.GetMainProgramHandle() in /Users/runner/work/node-api-dotnet/node-api-dotnet/src/NodeApi/Native/NativeLibrary.cs:line 35
	   at Microsoft.JavaScript.NodeApi.JSNativeApi.Interop.Initialize(IntPtr libraryHandle) in /Users/runner/work/node-api-dotnet/node-api-dotnet/src/NodeApi/Native/JSNativeApi.Interop.cs:line 31
	   at Microsoft.JavaScript.NodeApi.Interop.JSRuntimeContext..ctor(napi_env env) in /Users/runner/work/node-api-dotnet/node-api-dotnet/src/NodeApi/Interop/JSRuntimeContext.cs:line 120
	   at Microsoft.JavaScript.NodeApi.JSValueScope..ctor(JSValueScopeType scopeType, napi_env env) in /Users/runner/work/node-api-dotnet/node-api-dotnet/src/NodeApi/JSValueScope.cs:line 94
	   at Microsoft.JavaScript.NodeApi.DotNetHost.ManagedHost.InitializeModule(napi_env env, napi_value exports) in /Users/runner/work/node-api-dotnet/node-api-dotnet/src/NodeApi.DotNetHost/ManagedHost.cs:line 204
	
	Full output: /Users/runner/work/node-api-dotnet/node-api-dotnet/out/obj/Release/TestCases/node-addon-api/net6.0/hosted-object.log
❌ Test(id: "node-addon-api/object/set_property")
	Assert.Fail(): Node process exited with code: 134. 
	Unhandled exception. System.DllNotFoundException: Unable to load shared library 'libdl.so' or one of its dependencies. In order to help diagnose loading problems, consider setting the DYLD_PRINT_LIBRARIES environment variable: dlopen(liblibdl.so, 0x0001): tried: 'liblibdl.so' (no such file), '/usr/local/lib/liblibdl.so' (no such file), '/usr/lib/liblibdl.so' (no such file), '/Users/runner/work/node-api-dotnet/node-api-dotnet/out/obj/Release/TestCases/node-addon-api/net6.0/liblibdl.so' (no such file)
	   at Microsoft.JavaScript.NodeApi.NativeLibrary.dlopen1(IntPtr fileName, Int32 flags)
	   at Microsoft.JavaScript.NodeApi.NativeLibrary.dlopen(IntPtr fileName, Int32 flags) in /Users/runner/work/node-api-dotnet/node-api-dotnet/src/NodeApi/Native/NativeLibrary.cs:line 98
	   at Microsoft.JavaScript.NodeApi.NativeLibrary.GetMainProgramHandle() in /Users/runner/work/node-api-dotnet/node-api-dotnet/src/NodeApi/Native/NativeLibrary.cs:line 35
	   at Microsoft.JavaScript.NodeApi.JSNativeApi.Interop.Initialize(IntPtr libraryHandle) in /Users/runner/work/node-api-dotnet/node-api-dotnet/src/NodeApi/Native/JSNativeApi.Interop.cs:line 31
	   at Microsoft.JavaScript.NodeApi.Interop.JSRuntimeContext..ctor(napi_env env) in /Users/runner/work/node-api-dotnet/node-api-dotnet/src/NodeApi/Interop/JSRuntimeContext.cs:line 120
	   at Microsoft.JavaScript.NodeApi.JSValueScope..ctor(JSValueScopeType scopeType, napi_env env) in /Users/runner/work/node-api-dotnet/node-api-dotnet/src/NodeApi/JSValueScope.cs:line 94
	   at Microsoft.JavaScript.NodeApi.DotNetHost.ManagedHost.InitializeModule(napi_env env, napi_value exports) in /Users/runner/work/node-api-dotnet/node-api-dotnet/src/NodeApi.DotNetHost/ManagedHost.cs:line 204
	
	Full output: /Users/runner/work/node-api-dotnet/node-api-dotnet/out/obj/Release/TestCases/node-addon-api/net6.0/hosted-set_property.log
❌ Test(id: "node-addon-api/object/subscript_operator")
	Assert.Fail(): Node process exited with code: 134. 
	Unhandled exception. System.DllNotFoundException: Unable to load shared library 'libdl.so' or one of its dependencies. In order to help diagnose loading problems, consider setting the DYLD_PRINT_LIBRARIES environment variable: dlopen(liblibdl.so, 0x0001): tried: 'liblibdl.so' (no such file), '/usr/local/lib/liblibdl.so' (no such file), '/usr/lib/liblibdl.so' (no such file), '/Users/runner/work/node-api-dotnet/node-api-dotnet/out/obj/Release/TestCases/node-addon-api/net6.0/liblibdl.so' (no such file)
	   at Microsoft.JavaScript.NodeApi.NativeLibrary.dlopen1(IntPtr fileName, Int32 flags)
	   at Microsoft.JavaScript.NodeApi.NativeLibrary.dlopen(IntPtr fileName, Int32 flags) in /Users/runner/work/node-api-dotnet/node-api-dotnet/src/NodeApi/Native/NativeLibrary.cs:line 98
	   at Microsoft.JavaScript.NodeApi.NativeLibrary.GetMainProgramHandle() in /Users/runner/work/node-api-dotnet/node-api-dotnet/src/NodeApi/Native/NativeLibrary.cs:line 35
	   at Microsoft.JavaScript.NodeApi.JSNativeApi.Interop.Initialize(IntPtr libraryHandle) in /Users/runner/work/node-api-dotnet/node-api-dotnet/src/NodeApi/Native/JSNativeApi.Interop.cs:line 31
	   at Microsoft.JavaScript.NodeApi.Interop.JSRuntimeContext..ctor(napi_env env) in /Users/runner/work/node-api-dotnet/node-api-dotnet/src/NodeApi/Interop/JSRuntimeContext.cs:line 120
	   at Microsoft.JavaScript.NodeApi.JSValueScope..ctor(JSValueScopeType scopeType, napi_env env) in /Users/runner/work/node-api-dotnet/node-api-dotnet/src/NodeApi/JSValueScope.cs:line 94
	   at Microsoft.JavaScript.NodeApi.DotNetHost.ManagedHost.InitializeModule(napi_env env, napi_value exports) in /Users/runner/work/node-api-dotnet/node-api-dotnet/src/NodeApi.DotNetHost/ManagedHost.cs:line 204
	
	Full output: /Users/runner/work/node-api-dotnet/node-api-dotnet/out/obj/Release/TestCases/node-addon-api/net6.0/hosted-subscript_operator.log
✅ Test(id: "node-addon-api/testUtil")

❌ Microsoft.JavaScript.NodeApi.Test.JSProjectTests

❌ Test(id: "projects/js-cjs/test")
	Assert.Fail(): Node process exited with code: 134. 
	Unhandled exception. System.DllNotFoundException: Unable to load shared library 'libdl.so' or one of its dependencies. In order to help diagnose loading problems, consider setting the DYLD_PRINT_LIBRARIES environment variable: dlopen(liblibdl.so, 0x0001): tried: 'liblibdl.so' (no such file), '/usr/local/lib/liblibdl.so' (no such file), '/usr/lib/liblibdl.so' (no such file), '/Users/runner/work/node-api-dotnet/node-api-dotnet/out/obj/Release/TestCases/projects/net6.0/liblibdl.so' (no such file)
	   at Microsoft.JavaScript.NodeApi.NativeLibrary.dlopen1(IntPtr fileName, Int32 flags)
	   at Microsoft.JavaScript.NodeApi.NativeLibrary.dlopen(IntPtr fileName, Int32 flags)
	   at Microsoft.JavaScript.NodeApi.NativeLibrary.GetMainProgramHandle()
	   at Microsoft.JavaScript.NodeApi.JSNativeApi.Interop.Initialize(IntPtr libraryHandle)
	   at Microsoft.JavaScript.NodeApi.Interop.JSRuntimeContext..ctor(napi_env env)
	   at Microsoft.JavaScript.NodeApi.JSValueScope..ctor(JSValueScopeType scopeType, napi_env env)
	   at Microsoft.JavaScript.NodeApi.DotNetHost.ManagedHost.InitializeModule(napi_env env, napi_value exports)
	
	Full output: /Users/runner/work/node-api-dotnet/node-api-dotnet/out/obj/Release/TestCases/projects/net6.0/js-cjs-test.log
❌ Test(id: "projects/js-esm/test")
	Assert.Fail(): Node process exited with code: 134. 
	Unhandled exception. System.DllNotFoundException: Unable to load shared library 'libdl.so' or one of its dependencies. In order to help diagnose loading problems, consider setting the DYLD_PRINT_LIBRARIES environment variable: dlopen(liblibdl.so, 0x0001): tried: 'liblibdl.so' (no such file), '/usr/local/lib/liblibdl.so' (no such file), '/usr/lib/liblibdl.so' (no such file), '/Users/runner/work/node-api-dotnet/node-api-dotnet/out/obj/Release/TestCases/projects/net6.0/liblibdl.so' (no such file)
	   at Microsoft.JavaScript.NodeApi.NativeLibrary.dlopen1(IntPtr fileName, Int32 flags)
	   at Microsoft.JavaScript.NodeApi.NativeLibrary.dlopen(IntPtr fileName, Int32 flags)
	   at Microsoft.JavaScript.NodeApi.NativeLibrary.GetMainProgramHandle()
	   at Microsoft.JavaScript.NodeApi.JSNativeApi.Interop.Initialize(IntPtr libraryHandle)
	   at Microsoft.JavaScript.NodeApi.Interop.JSRuntimeContext..ctor(napi_env env)
	   at Microsoft.JavaScript.NodeApi.JSValueScope..ctor(JSValueScopeType scopeType, napi_env env)
	   at Microsoft.JavaScript.NodeApi.DotNetHost.ManagedHost.InitializeModule(napi_env env, napi_value exports)
	
	Full output: /Users/runner/work/node-api-dotnet/node-api-dotnet/out/obj/Release/TestCases/projects/net6.0/js-esm-test.log
❌ Test(id: "projects/ts-cjs/test")
	Assert.Fail(): Node process exited with code: 134. 
	Unhandled exception. System.DllNotFoundException: Unable to load shared library 'libdl.so' or one of its dependencies. In order to help diagnose loading problems, consider setting the DYLD_PRINT_LIBRARIES environment variable: dlopen(liblibdl.so, 0x0001): tried: 'liblibdl.so' (no such file), '/usr/local/lib/liblibdl.so' (no such file), '/usr/lib/liblibdl.so' (no such file), '/Users/runner/work/node-api-dotnet/node-api-dotnet/out/obj/Release/TestCases/projects/net6.0/liblibdl.so' (no such file)
	   at Microsoft.JavaScript.NodeApi.NativeLibrary.dlopen1(IntPtr fileName, Int32 flags)
	   at Microsoft.JavaScript.NodeApi.NativeLibrary.dlopen(IntPtr fileName, Int32 flags)
	   at Microsoft.JavaScript.NodeApi.NativeLibrary.GetMainProgramHandle()
	   at Microsoft.JavaScript.NodeApi.JSNativeApi.Interop.Initialize(IntPtr libraryHandle)
	   at Microsoft.JavaScript.NodeApi.Interop.JSRuntimeContext..ctor(napi_env env)
	   at Microsoft.JavaScript.NodeApi.JSValueScope..ctor(JSValueScopeType scopeType, napi_env env)
	   at Microsoft.JavaScript.NodeApi.DotNetHost.ManagedHost.InitializeModule(napi_env env, napi_value exports)
	
	Full output: /Users/runner/work/node-api-dotnet/node-api-dotnet/out/obj/Release/TestCases/projects/net6.0/ts-cjs-test.log
❌ Test(id: "projects/ts-esm/test")
	Assert.Fail(): Node process exited with code: 134. 
	Unhandled exception. System.DllNotFoundException: Unable to load shared library 'libdl.so' or one of its dependencies. In order to help diagnose loading problems, consider setting the DYLD_PRINT_LIBRARIES environment variable: dlopen(liblibdl.so, 0x0001): tried: 'liblibdl.so' (no such file), '/usr/local/lib/liblibdl.so' (no such file), '/usr/lib/liblibdl.so' (no such file), '/Users/runner/work/node-api-dotnet/node-api-dotnet/out/obj/Release/TestCases/projects/net6.0/liblibdl.so' (no such file)
	   at Microsoft.JavaScript.NodeApi.NativeLibrary.dlopen1(IntPtr fileName, Int32 flags)
	   at Microsoft.JavaScript.NodeApi.NativeLibrary.dlopen(IntPtr fileName, Int32 flags)
	   at Microsoft.JavaScript.NodeApi.NativeLibrary.GetMainProgramHandle()
	   at Microsoft.JavaScript.NodeApi.JSNativeApi.Interop.Initialize(IntPtr libraryHandle)
	   at Microsoft.JavaScript.NodeApi.Interop.JSRuntimeContext..ctor(napi_env env)
	   at Microsoft.JavaScript.NodeApi.JSValueScope..ctor(JSValueScopeType scopeType, napi_env env)
	   at Microsoft.JavaScript.NodeApi.DotNetHost.ManagedHost.InitializeModule(napi_env env, napi_value exports)
	
	Full output: /Users/runner/work/node-api-dotnet/node-api-dotnet/out/obj/Release/TestCases/projects/net6.0/ts-esm-test.log

❌ test/dotnet8-node18.x-Release/_Mac-1695100558872_2023-09-19_05_22_05.trx

69 tests were completed in 218s with 62 passed, 4 failed and 3 skipped.

Test suite Passed Failed Skipped Time
Microsoft.JavaScript.NodeApi.Test.HostedClrTests 28✅ 66s
Microsoft.JavaScript.NodeApi.Test.JSProjectTests 4❌ 97s
Microsoft.JavaScript.NodeApi.Test.NativeAotTests 25✅ 52s
Microsoft.JavaScript.NodeApi.Test.NodejsEmbeddingTests 3⚪ 3ms
Microsoft.JavaScript.NodeApi.Test.TypeDefsGeneratorTests 9✅ 30ms

❌ Microsoft.JavaScript.NodeApi.Test.JSProjectTests

❌ Test(id: "projects/js-cjs/test")
	Assert.Fail(): Node process exited with code: 134. 
	Unhandled exception. System.DllNotFoundException: Unable to load shared library 'libdl.so' or one of its dependencies. In order to help diagnose loading problems, consider setting the DYLD_PRINT_LIBRARIES environment variable: dlopen(liblibdl.so, 0x0001): tried: 'liblibdl.so' (no such file), '/usr/local/lib/liblibdl.so' (no such file), '/usr/lib/liblibdl.so' (no such file), '/Users/runner/work/node-api-dotnet/node-api-dotnet/out/obj/Release/TestCases/projects/net8.0/liblibdl.so' (no such file)
	   at Microsoft.JavaScript.NodeApi.NativeLibrary.dlopen1(IntPtr fileName, Int32 flags)
	   at Microsoft.JavaScript.NodeApi.NativeLibrary.dlopen(IntPtr fileName, Int32 flags)
	   at Microsoft.JavaScript.NodeApi.NativeLibrary.GetMainProgramHandle()
	   at Microsoft.JavaScript.NodeApi.JSNativeApi.Interop.Initialize(IntPtr libraryHandle)
	   at Microsoft.JavaScript.NodeApi.Interop.JSRuntimeContext..ctor(napi_env env)
	   at Microsoft.JavaScript.NodeApi.JSValueScope..ctor(JSValueScopeType scopeType, napi_env env)
	   at Microsoft.JavaScript.NodeApi.DotNetHost.ManagedHost.InitializeModule(napi_env env, napi_value exports)
	
	Full output: /Users/runner/work/node-api-dotnet/node-api-dotnet/out/obj/Release/TestCases/projects/net8.0/js-cjs-test.log
❌ Test(id: "projects/js-esm/test")
	Assert.Fail(): Node process exited with code: 134. 
	Unhandled exception. System.DllNotFoundException: Unable to load shared library 'libdl.so' or one of its dependencies. In order to help diagnose loading problems, consider setting the DYLD_PRINT_LIBRARIES environment variable: dlopen(liblibdl.so, 0x0001): tried: 'liblibdl.so' (no such file), '/usr/local/lib/liblibdl.so' (no such file), '/usr/lib/liblibdl.so' (no such file), '/Users/runner/work/node-api-dotnet/node-api-dotnet/out/obj/Release/TestCases/projects/net8.0/liblibdl.so' (no such file)
	   at Microsoft.JavaScript.NodeApi.NativeLibrary.dlopen1(IntPtr fileName, Int32 flags)
	   at Microsoft.JavaScript.NodeApi.NativeLibrary.dlopen(IntPtr fileName, Int32 flags)
	   at Microsoft.JavaScript.NodeApi.NativeLibrary.GetMainProgramHandle()
	   at Microsoft.JavaScript.NodeApi.JSNativeApi.Interop.Initialize(IntPtr libraryHandle)
	   at Microsoft.JavaScript.NodeApi.Interop.JSRuntimeContext..ctor(napi_env env)
	   at Microsoft.JavaScript.NodeApi.JSValueScope..ctor(JSValueScopeType scopeType, napi_env env)
	   at Microsoft.JavaScript.NodeApi.DotNetHost.ManagedHost.InitializeModule(napi_env env, napi_value exports)
	
	Full output: /Users/runner/work/node-api-dotnet/node-api-dotnet/out/obj/Release/TestCases/projects/net8.0/js-esm-test.log
❌ Test(id: "projects/ts-cjs/test")
	Assert.Fail(): Node process exited with code: 134. 
	Unhandled exception. System.DllNotFoundException: Unable to load shared library 'libdl.so' or one of its dependencies. In order to help diagnose loading problems, consider setting the DYLD_PRINT_LIBRARIES environment variable: dlopen(liblibdl.so, 0x0001): tried: 'liblibdl.so' (no such file), '/usr/local/lib/liblibdl.so' (no such file), '/usr/lib/liblibdl.so' (no such file), '/Users/runner/work/node-api-dotnet/node-api-dotnet/out/obj/Release/TestCases/projects/net8.0/liblibdl.so' (no such file)
	   at Microsoft.JavaScript.NodeApi.NativeLibrary.dlopen1(IntPtr fileName, Int32 flags)
	   at Microsoft.JavaScript.NodeApi.NativeLibrary.dlopen(IntPtr fileName, Int32 flags)
	   at Microsoft.JavaScript.NodeApi.NativeLibrary.GetMainProgramHandle()
	   at Microsoft.JavaScript.NodeApi.JSNativeApi.Interop.Initialize(IntPtr libraryHandle)
	   at Microsoft.JavaScript.NodeApi.Interop.JSRuntimeContext..ctor(napi_env env)
	   at Microsoft.JavaScript.NodeApi.JSValueScope..ctor(JSValueScopeType scopeType, napi_env env)
	   at Microsoft.JavaScript.NodeApi.DotNetHost.ManagedHost.InitializeModule(napi_env env, napi_value exports)
	
	Full output: /Users/runner/work/node-api-dotnet/node-api-dotnet/out/obj/Release/TestCases/projects/net8.0/ts-cjs-test.log
❌ Test(id: "projects/ts-esm/test")
	Assert.Fail(): Node process exited with code: 134. 
	Unhandled exception. System.DllNotFoundException: Unable to load shared library 'libdl.so' or one of its dependencies. In order to help diagnose loading problems, consider setting the DYLD_PRINT_LIBRARIES environment variable: dlopen(liblibdl.so, 0x0001): tried: 'liblibdl.so' (no such file), '/usr/local/lib/liblibdl.so' (no such file), '/usr/lib/liblibdl.so' (no such file), '/Users/runner/work/node-api-dotnet/node-api-dotnet/out/obj/Release/TestCases/projects/net8.0/liblibdl.so' (no such file)

Report exceeded GitHub limit of 65535 bytes and has been trimmed

Annotations

Check failure on line 274 in test/TestBuilder.cs

See this annotation in the file changed.

@github-actions github-actions / test results (macos-latest, node18.x, Release)

Microsoft.JavaScript.NodeApi.Test.HostedClrTests ► Test(id: "edgejs-perf/measure-latency")

Failed test found in:
  test/dotnet6-node18.x-Release/_Mac-1695100558872_2023-09-19_05_19_43.trx
Error:
  Assert.Fail(): Node process exited with code: 134. 
  Unhandled exception. System.DllNotFoundException: Unable to load shared library 'libdl.so' or one of its dependencies. In order to help diagnose loading problems, consider setting the DYLD_PRINT_LIBRARIES environment variable: dlopen(liblibdl.so, 0x0001): tried: 'liblibdl.so' (no such file), '/usr/local/lib/liblibdl.so' (no such file), '/usr/lib/liblibdl.so' (no such file), '/Users/runner/work/node-api-dotnet/node-api-dotnet/out/obj/Release/TestCases/edgejs-perf/net6.0/liblibdl.so' (no such file)
     at Microsoft.JavaScript.NodeApi.NativeLibrary.dlopen1(IntPtr fileName, Int32 flags)
     at Microsoft.JavaScript.NodeApi.NativeLibrary.dlopen(IntPtr fileName, Int32 flags) in /Users/runner/work/node-api-dotnet/node-api-dotnet/src/NodeApi/Native/NativeLibrary.cs:line 98
     at Microsoft.JavaScript.NodeApi.NativeLibrary.GetMainProgramHandle() in /Users/runner/work/node-api-dotnet/node-api-dotnet/src/NodeApi/Native/NativeLibrary.cs:line 35
     at Microsoft.JavaScript.NodeApi.JSNativeApi.Interop.Initialize(IntPtr libraryHandle) in /Users/runner/work/node-api-dotnet/node-api-dotnet/src/NodeApi/Native/JSNativeApi.Interop.cs:line 31
     at Microsoft.JavaScript.NodeApi.Interop.JSRuntimeContext..ctor(napi_env env) in /Users/runner/work/node-api-dotnet/node-api-dotnet/src/NodeApi/Interop/JSRuntimeContext.cs:line 120
     at Microsoft.JavaScript.NodeApi.JSValueScope..ctor(JSValueScopeType scopeType, napi_env env) in /Users/runner/work/node-api-dotnet/node-api-dotnet/src/NodeApi/JSValueScope.cs:line 94
     at Microsoft.JavaScript.NodeApi.DotNetHost.ManagedHost.InitializeModule(napi_env env, napi_value exports) in /Users/runner/work/node-api-dotnet/node-api-dotnet/src/NodeApi.DotNetHost/ManagedHost.cs:line 204
  
  Full output: /Users/runner/work/node-api-dotnet/node-api-dotnet/out/obj/Release/TestCases/edgejs-perf/net6.0/hosted-measure-latency.log
Raw output
Assert.Fail(): Node process exited with code: 134. 
Unhandled exception. System.DllNotFoundException: Unable to load shared library 'libdl.so' or one of its dependencies. In order to help diagnose loading problems, consider setting the DYLD_PRINT_LIBRARIES environment variable: dlopen(liblibdl.so, 0x0001): tried: 'liblibdl.so' (no such file), '/usr/local/lib/liblibdl.so' (no such file), '/usr/lib/liblibdl.so' (no such file), '/Users/runner/work/node-api-dotnet/node-api-dotnet/out/obj/Release/TestCases/edgejs-perf/net6.0/liblibdl.so' (no such file)
   at Microsoft.JavaScript.NodeApi.NativeLibrary.dlopen1(IntPtr fileName, Int32 flags)
   at Microsoft.JavaScript.NodeApi.NativeLibrary.dlopen(IntPtr fileName, Int32 flags) in /Users/runner/work/node-api-dotnet/node-api-dotnet/src/NodeApi/Native/NativeLibrary.cs:line 98
   at Microsoft.JavaScript.NodeApi.NativeLibrary.GetMainProgramHandle() in /Users/runner/work/node-api-dotnet/node-api-dotnet/src/NodeApi/Native/NativeLibrary.cs:line 35
   at Microsoft.JavaScript.NodeApi.JSNativeApi.Interop.Initialize(IntPtr libraryHandle) in /Users/runner/work/node-api-dotnet/node-api-dotnet/src/NodeApi/Native/JSNativeApi.Interop.cs:line 31
   at Microsoft.JavaScript.NodeApi.Interop.JSRuntimeContext..ctor(napi_env env) in /Users/runner/work/node-api-dotnet/node-api-dotnet/src/NodeApi/Interop/JSRuntimeContext.cs:line 120
   at Microsoft.JavaScript.NodeApi.JSValueScope..ctor(JSValueScopeType scopeType, napi_env env) in /Users/runner/work/node-api-dotnet/node-api-dotnet/src/NodeApi/JSValueScope.cs:line 94
   at Microsoft.JavaScript.NodeApi.DotNetHost.ManagedHost.InitializeModule(napi_env env, napi_value exports) in /Users/runner/work/node-api-dotnet/node-api-dotnet/src/NodeApi.DotNetHost/ManagedHost.cs:line 204

Full output: /Users/runner/work/node-api-dotnet/node-api-dotnet/out/obj/Release/TestCases/edgejs-perf/net6.0/hosted-measure-latency.log
   at Microsoft.JavaScript.NodeApi.Test.TestBuilder.RunNodeTestCase(String jsFilePath, String logFilePath, IDictionary`2 testEnvironmentVariables) in /Users/runner/work/node-api-dotnet/node-api-dotnet/test/TestBuilder.cs:line 274
   at Microsoft.JavaScript.NodeApi.Test.HostedClrTests.Test(String id) in /Users/runner/work/node-api-dotnet/node-api-dotnet/test/HostedClrTests.cs:line 95

Check failure on line 274 in test/TestBuilder.cs

See this annotation in the file changed.

@github-actions github-actions / test results (macos-latest, node18.x, Release)

Microsoft.JavaScript.NodeApi.Test.HostedClrTests ► Test(id: "napi-dotnet-init/custom_export")

Failed test found in:
  test/dotnet6-node18.x-Release/_Mac-1695100558872_2023-09-19_05_19_43.trx
Error:
  Assert.Fail(): Node process exited with code: 134. 
  Unhandled exception. System.DllNotFoundException: Unable to load shared library 'libdl.so' or one of its dependencies. In order to help diagnose loading problems, consider setting the DYLD_PRINT_LIBRARIES environment variable: dlopen(liblibdl.so, 0x0001): tried: 'liblibdl.so' (no such file), '/usr/local/lib/liblibdl.so' (no such file), '/usr/lib/liblibdl.so' (no such file), '/Users/runner/work/node-api-dotnet/node-api-dotnet/out/obj/Release/TestCases/napi-dotnet-init/net6.0/liblibdl.so' (no such file)
     at Microsoft.JavaScript.NodeApi.NativeLibrary.dlopen1(IntPtr fileName, Int32 flags)
     at Microsoft.JavaScript.NodeApi.NativeLibrary.dlopen(IntPtr fileName, Int32 flags) in /Users/runner/work/node-api-dotnet/node-api-dotnet/src/NodeApi/Native/NativeLibrary.cs:line 98
     at Microsoft.JavaScript.NodeApi.NativeLibrary.GetMainProgramHandle() in /Users/runner/work/node-api-dotnet/node-api-dotnet/src/NodeApi/Native/NativeLibrary.cs:line 35
     at Microsoft.JavaScript.NodeApi.JSNativeApi.Interop.Initialize(IntPtr libraryHandle) in /Users/runner/work/node-api-dotnet/node-api-dotnet/src/NodeApi/Native/JSNativeApi.Interop.cs:line 31
     at Microsoft.JavaScript.NodeApi.Interop.JSRuntimeContext..ctor(napi_env env) in /Users/runner/work/node-api-dotnet/node-api-dotnet/src/NodeApi/Interop/JSRuntimeContext.cs:line 120
     at Microsoft.JavaScript.NodeApi.JSValueScope..ctor(JSValueScopeType scopeType, napi_env env) in /Users/runner/work/node-api-dotnet/node-api-dotnet/src/NodeApi/JSValueScope.cs:line 94
     at Microsoft.JavaScript.NodeApi.DotNetHost.ManagedHost.InitializeModule(napi_env env, napi_value exports) in /Users/runner/work/node-api-dotnet/node-api-dotnet/src/NodeApi.DotNetHost/ManagedHost.cs:line 204
  
  Full output: /Users/runner/work/node-api-dotnet/node-api-dotnet/out/obj/Release/TestCases/napi-dotnet-init/net6.0/hosted-custom_export.log
Raw output
Assert.Fail(): Node process exited with code: 134. 
Unhandled exception. System.DllNotFoundException: Unable to load shared library 'libdl.so' or one of its dependencies. In order to help diagnose loading problems, consider setting the DYLD_PRINT_LIBRARIES environment variable: dlopen(liblibdl.so, 0x0001): tried: 'liblibdl.so' (no such file), '/usr/local/lib/liblibdl.so' (no such file), '/usr/lib/liblibdl.so' (no such file), '/Users/runner/work/node-api-dotnet/node-api-dotnet/out/obj/Release/TestCases/napi-dotnet-init/net6.0/liblibdl.so' (no such file)
   at Microsoft.JavaScript.NodeApi.NativeLibrary.dlopen1(IntPtr fileName, Int32 flags)
   at Microsoft.JavaScript.NodeApi.NativeLibrary.dlopen(IntPtr fileName, Int32 flags) in /Users/runner/work/node-api-dotnet/node-api-dotnet/src/NodeApi/Native/NativeLibrary.cs:line 98
   at Microsoft.JavaScript.NodeApi.NativeLibrary.GetMainProgramHandle() in /Users/runner/work/node-api-dotnet/node-api-dotnet/src/NodeApi/Native/NativeLibrary.cs:line 35
   at Microsoft.JavaScript.NodeApi.JSNativeApi.Interop.Initialize(IntPtr libraryHandle) in /Users/runner/work/node-api-dotnet/node-api-dotnet/src/NodeApi/Native/JSNativeApi.Interop.cs:line 31
   at Microsoft.JavaScript.NodeApi.Interop.JSRuntimeContext..ctor(napi_env env) in /Users/runner/work/node-api-dotnet/node-api-dotnet/src/NodeApi/Interop/JSRuntimeContext.cs:line 120
   at Microsoft.JavaScript.NodeApi.JSValueScope..ctor(JSValueScopeType scopeType, napi_env env) in /Users/runner/work/node-api-dotnet/node-api-dotnet/src/NodeApi/JSValueScope.cs:line 94
   at Microsoft.JavaScript.NodeApi.DotNetHost.ManagedHost.InitializeModule(napi_env env, napi_value exports) in /Users/runner/work/node-api-dotnet/node-api-dotnet/src/NodeApi.DotNetHost/ManagedHost.cs:line 204

Full output: /Users/runner/work/node-api-dotnet/node-api-dotnet/out/obj/Release/TestCases/napi-dotnet-init/net6.0/hosted-custom_export.log
   at Microsoft.JavaScript.NodeApi.Test.TestBuilder.RunNodeTestCase(String jsFilePath, String logFilePath, IDictionary`2 testEnvironmentVariables) in /Users/runner/work/node-api-dotnet/node-api-dotnet/test/TestBuilder.cs:line 274
   at Microsoft.JavaScript.NodeApi.Test.HostedClrTests.Test(String id) in /Users/runner/work/node-api-dotnet/node-api-dotnet/test/HostedClrTests.cs:line 95

Check failure on line 274 in test/TestBuilder.cs

See this annotation in the file changed.

@github-actions github-actions / test results (macos-latest, node18.x, Release)

Microsoft.JavaScript.NodeApi.Test.HostedClrTests ► Test(id: "napi-dotnet-init/custom_init")

Failed test found in:
  test/dotnet6-node18.x-Release/_Mac-1695100558872_2023-09-19_05_19_43.trx
Error:
  Assert.Fail(): Node process exited with code: 134. 
  Unhandled exception. System.DllNotFoundException: Unable to load shared library 'libdl.so' or one of its dependencies. In order to help diagnose loading problems, consider setting the DYLD_PRINT_LIBRARIES environment variable: dlopen(liblibdl.so, 0x0001): tried: 'liblibdl.so' (no such file), '/usr/local/lib/liblibdl.so' (no such file), '/usr/lib/liblibdl.so' (no such file), '/Users/runner/work/node-api-dotnet/node-api-dotnet/out/obj/Release/TestCases/napi-dotnet-init/net6.0/liblibdl.so' (no such file)
     at Microsoft.JavaScript.NodeApi.NativeLibrary.dlopen1(IntPtr fileName, Int32 flags)
     at Microsoft.JavaScript.NodeApi.NativeLibrary.dlopen(IntPtr fileName, Int32 flags) in /Users/runner/work/node-api-dotnet/node-api-dotnet/src/NodeApi/Native/NativeLibrary.cs:line 98
     at Microsoft.JavaScript.NodeApi.NativeLibrary.GetMainProgramHandle() in /Users/runner/work/node-api-dotnet/node-api-dotnet/src/NodeApi/Native/NativeLibrary.cs:line 35
     at Microsoft.JavaScript.NodeApi.JSNativeApi.Interop.Initialize(IntPtr libraryHandle) in /Users/runner/work/node-api-dotnet/node-api-dotnet/src/NodeApi/Native/JSNativeApi.Interop.cs:line 31
     at Microsoft.JavaScript.NodeApi.Interop.JSRuntimeContext..ctor(napi_env env) in /Users/runner/work/node-api-dotnet/node-api-dotnet/src/NodeApi/Interop/JSRuntimeContext.cs:line 120
     at Microsoft.JavaScript.NodeApi.JSValueScope..ctor(JSValueScopeType scopeType, napi_env env) in /Users/runner/work/node-api-dotnet/node-api-dotnet/src/NodeApi/JSValueScope.cs:line 94
     at Microsoft.JavaScript.NodeApi.DotNetHost.ManagedHost.InitializeModule(napi_env env, napi_value exports) in /Users/runner/work/node-api-dotnet/node-api-dotnet/src/NodeApi.DotNetHost/ManagedHost.cs:line 204
  
  Full output: /Users/runner/work/node-api-dotnet/node-api-dotnet/out/obj/Release/TestCases/napi-dotnet-init/net6.0/hosted-custom_init.log
Raw output
Assert.Fail(): Node process exited with code: 134. 
Unhandled exception. System.DllNotFoundException: Unable to load shared library 'libdl.so' or one of its dependencies. In order to help diagnose loading problems, consider setting the DYLD_PRINT_LIBRARIES environment variable: dlopen(liblibdl.so, 0x0001): tried: 'liblibdl.so' (no such file), '/usr/local/lib/liblibdl.so' (no such file), '/usr/lib/liblibdl.so' (no such file), '/Users/runner/work/node-api-dotnet/node-api-dotnet/out/obj/Release/TestCases/napi-dotnet-init/net6.0/liblibdl.so' (no such file)
   at Microsoft.JavaScript.NodeApi.NativeLibrary.dlopen1(IntPtr fileName, Int32 flags)
   at Microsoft.JavaScript.NodeApi.NativeLibrary.dlopen(IntPtr fileName, Int32 flags) in /Users/runner/work/node-api-dotnet/node-api-dotnet/src/NodeApi/Native/NativeLibrary.cs:line 98
   at Microsoft.JavaScript.NodeApi.NativeLibrary.GetMainProgramHandle() in /Users/runner/work/node-api-dotnet/node-api-dotnet/src/NodeApi/Native/NativeLibrary.cs:line 35
   at Microsoft.JavaScript.NodeApi.JSNativeApi.Interop.Initialize(IntPtr libraryHandle) in /Users/runner/work/node-api-dotnet/node-api-dotnet/src/NodeApi/Native/JSNativeApi.Interop.cs:line 31
   at Microsoft.JavaScript.NodeApi.Interop.JSRuntimeContext..ctor(napi_env env) in /Users/runner/work/node-api-dotnet/node-api-dotnet/src/NodeApi/Interop/JSRuntimeContext.cs:line 120
   at Microsoft.JavaScript.NodeApi.JSValueScope..ctor(JSValueScopeType scopeType, napi_env env) in /Users/runner/work/node-api-dotnet/node-api-dotnet/src/NodeApi/JSValueScope.cs:line 94
   at Microsoft.JavaScript.NodeApi.DotNetHost.ManagedHost.InitializeModule(napi_env env, napi_value exports) in /Users/runner/work/node-api-dotnet/node-api-dotnet/src/NodeApi.DotNetHost/ManagedHost.cs:line 204

Full output: /Users/runner/work/node-api-dotnet/node-api-dotnet/out/obj/Release/TestCases/napi-dotnet-init/net6.0/hosted-custom_init.log
   at Microsoft.JavaScript.NodeApi.Test.TestBuilder.RunNodeTestCase(String jsFilePath, String logFilePath, IDictionary`2 testEnvironmentVariables) in /Users/runner/work/node-api-dotnet/node-api-dotnet/test/TestBuilder.cs:line 274
   at Microsoft.JavaScript.NodeApi.Test.HostedClrTests.Test(String id) in /Users/runner/work/node-api-dotnet/node-api-dotnet/test/HostedClrTests.cs:line 95

Check failure on line 274 in test/TestBuilder.cs

See this annotation in the file changed.

@github-actions github-actions / test results (macos-latest, node18.x, Release)

Microsoft.JavaScript.NodeApi.Test.HostedClrTests ► Test(id: "napi-dotnet/async_methods")

Failed test found in:
  test/dotnet6-node18.x-Release/_Mac-1695100558872_2023-09-19_05_19_43.trx
Error:
  Assert.Fail(): Node process exited with code: 134. 
  Unhandled exception. System.DllNotFoundException: Unable to load shared library 'libdl.so' or one of its dependencies. In order to help diagnose loading problems, consider setting the DYLD_PRINT_LIBRARIES environment variable: dlopen(liblibdl.so, 0x0001): tried: 'liblibdl.so' (no such file), '/usr/local/lib/liblibdl.so' (no such file), '/usr/lib/liblibdl.so' (no such file), '/Users/runner/work/node-api-dotnet/node-api-dotnet/out/obj/Release/TestCases/napi-dotnet/net6.0/liblibdl.so' (no such file)
     at Microsoft.JavaScript.NodeApi.NativeLibrary.dlopen1(IntPtr fileName, Int32 flags)
     at Microsoft.JavaScript.NodeApi.NativeLibrary.dlopen(IntPtr fileName, Int32 flags) in /Users/runner/work/node-api-dotnet/node-api-dotnet/src/NodeApi/Native/NativeLibrary.cs:line 98
     at Microsoft.JavaScript.NodeApi.NativeLibrary.GetMainProgramHandle() in /Users/runner/work/node-api-dotnet/node-api-dotnet/src/NodeApi/Native/NativeLibrary.cs:line 35
     at Microsoft.JavaScript.NodeApi.JSNativeApi.Interop.Initialize(IntPtr libraryHandle) in /Users/runner/work/node-api-dotnet/node-api-dotnet/src/NodeApi/Native/JSNativeApi.Interop.cs:line 31
     at Microsoft.JavaScript.NodeApi.Interop.JSRuntimeContext..ctor(napi_env env) in /Users/runner/work/node-api-dotnet/node-api-dotnet/src/NodeApi/Interop/JSRuntimeContext.cs:line 120
     at Microsoft.JavaScript.NodeApi.JSValueScope..ctor(JSValueScopeType scopeType, napi_env env) in /Users/runner/work/node-api-dotnet/node-api-dotnet/src/NodeApi/JSValueScope.cs:line 94
     at Microsoft.JavaScript.NodeApi.DotNetHost.ManagedHost.InitializeModule(napi_env env, napi_value exports) in /Users/runner/work/node-api-dotnet/node-api-dotnet/src/NodeApi.DotNetHost/ManagedHost.cs:line 204
  
  Full output: /Users/runner/work/node-api-dotnet/node-api-dotnet/out/obj/Release/TestCases/napi-dotnet/net6.0/hosted-async_methods.log
Raw output
Assert.Fail(): Node process exited with code: 134. 
Unhandled exception. System.DllNotFoundException: Unable to load shared library 'libdl.so' or one of its dependencies. In order to help diagnose loading problems, consider setting the DYLD_PRINT_LIBRARIES environment variable: dlopen(liblibdl.so, 0x0001): tried: 'liblibdl.so' (no such file), '/usr/local/lib/liblibdl.so' (no such file), '/usr/lib/liblibdl.so' (no such file), '/Users/runner/work/node-api-dotnet/node-api-dotnet/out/obj/Release/TestCases/napi-dotnet/net6.0/liblibdl.so' (no such file)
   at Microsoft.JavaScript.NodeApi.NativeLibrary.dlopen1(IntPtr fileName, Int32 flags)
   at Microsoft.JavaScript.NodeApi.NativeLibrary.dlopen(IntPtr fileName, Int32 flags) in /Users/runner/work/node-api-dotnet/node-api-dotnet/src/NodeApi/Native/NativeLibrary.cs:line 98
   at Microsoft.JavaScript.NodeApi.NativeLibrary.GetMainProgramHandle() in /Users/runner/work/node-api-dotnet/node-api-dotnet/src/NodeApi/Native/NativeLibrary.cs:line 35
   at Microsoft.JavaScript.NodeApi.JSNativeApi.Interop.Initialize(IntPtr libraryHandle) in /Users/runner/work/node-api-dotnet/node-api-dotnet/src/NodeApi/Native/JSNativeApi.Interop.cs:line 31
   at Microsoft.JavaScript.NodeApi.Interop.JSRuntimeContext..ctor(napi_env env) in /Users/runner/work/node-api-dotnet/node-api-dotnet/src/NodeApi/Interop/JSRuntimeContext.cs:line 120
   at Microsoft.JavaScript.NodeApi.JSValueScope..ctor(JSValueScopeType scopeType, napi_env env) in /Users/runner/work/node-api-dotnet/node-api-dotnet/src/NodeApi/JSValueScope.cs:line 94
   at Microsoft.JavaScript.NodeApi.DotNetHost.ManagedHost.InitializeModule(napi_env env, napi_value exports) in /Users/runner/work/node-api-dotnet/node-api-dotnet/src/NodeApi.DotNetHost/ManagedHost.cs:line 204

Full output: /Users/runner/work/node-api-dotnet/node-api-dotnet/out/obj/Release/TestCases/napi-dotnet/net6.0/hosted-async_methods.log
   at Microsoft.JavaScript.NodeApi.Test.TestBuilder.RunNodeTestCase(String jsFilePath, String logFilePath, IDictionary`2 testEnvironmentVariables) in /Users/runner/work/node-api-dotnet/node-api-dotnet/test/TestBuilder.cs:line 274
   at Microsoft.JavaScript.NodeApi.Test.HostedClrTests.Test(String id) in /Users/runner/work/node-api-dotnet/node-api-dotnet/test/HostedClrTests.cs:line 95

Check failure on line 274 in test/TestBuilder.cs

See this annotation in the file changed.

@github-actions github-actions / test results (macos-latest, node18.x, Release)

Microsoft.JavaScript.NodeApi.Test.HostedClrTests ► Test(id: "napi-dotnet/complex_types")

Failed test found in:
  test/dotnet6-node18.x-Release/_Mac-1695100558872_2023-09-19_05_19_43.trx
Error:
  Assert.Fail(): Node process exited with code: 134. 
  Unhandled exception. System.DllNotFoundException: Unable to load shared library 'libdl.so' or one of its dependencies. In order to help diagnose loading problems, consider setting the DYLD_PRINT_LIBRARIES environment variable: dlopen(liblibdl.so, 0x0001): tried: 'liblibdl.so' (no such file), '/usr/local/lib/liblibdl.so' (no such file), '/usr/lib/liblibdl.so' (no such file), '/Users/runner/work/node-api-dotnet/node-api-dotnet/out/obj/Release/TestCases/napi-dotnet/net6.0/liblibdl.so' (no such file)
     at Microsoft.JavaScript.NodeApi.NativeLibrary.dlopen1(IntPtr fileName, Int32 flags)
     at Microsoft.JavaScript.NodeApi.NativeLibrary.dlopen(IntPtr fileName, Int32 flags) in /Users/runner/work/node-api-dotnet/node-api-dotnet/src/NodeApi/Native/NativeLibrary.cs:line 98
     at Microsoft.JavaScript.NodeApi.NativeLibrary.GetMainProgramHandle() in /Users/runner/work/node-api-dotnet/node-api-dotnet/src/NodeApi/Native/NativeLibrary.cs:line 35
     at Microsoft.JavaScript.NodeApi.JSNativeApi.Interop.Initialize(IntPtr libraryHandle) in /Users/runner/work/node-api-dotnet/node-api-dotnet/src/NodeApi/Native/JSNativeApi.Interop.cs:line 31
     at Microsoft.JavaScript.NodeApi.Interop.JSRuntimeContext..ctor(napi_env env) in /Users/runner/work/node-api-dotnet/node-api-dotnet/src/NodeApi/Interop/JSRuntimeContext.cs:line 120
     at Microsoft.JavaScript.NodeApi.JSValueScope..ctor(JSValueScopeType scopeType, napi_env env) in /Users/runner/work/node-api-dotnet/node-api-dotnet/src/NodeApi/JSValueScope.cs:line 94
     at Microsoft.JavaScript.NodeApi.DotNetHost.ManagedHost.InitializeModule(napi_env env, napi_value exports) in /Users/runner/work/node-api-dotnet/node-api-dotnet/src/NodeApi.DotNetHost/ManagedHost.cs:line 204
  
  Full output: /Users/runner/work/node-api-dotnet/node-api-dotnet/out/obj/Release/TestCases/napi-dotnet/net6.0/hosted-complex_types.log
Raw output
Assert.Fail(): Node process exited with code: 134. 
Unhandled exception. System.DllNotFoundException: Unable to load shared library 'libdl.so' or one of its dependencies. In order to help diagnose loading problems, consider setting the DYLD_PRINT_LIBRARIES environment variable: dlopen(liblibdl.so, 0x0001): tried: 'liblibdl.so' (no such file), '/usr/local/lib/liblibdl.so' (no such file), '/usr/lib/liblibdl.so' (no such file), '/Users/runner/work/node-api-dotnet/node-api-dotnet/out/obj/Release/TestCases/napi-dotnet/net6.0/liblibdl.so' (no such file)
   at Microsoft.JavaScript.NodeApi.NativeLibrary.dlopen1(IntPtr fileName, Int32 flags)
   at Microsoft.JavaScript.NodeApi.NativeLibrary.dlopen(IntPtr fileName, Int32 flags) in /Users/runner/work/node-api-dotnet/node-api-dotnet/src/NodeApi/Native/NativeLibrary.cs:line 98
   at Microsoft.JavaScript.NodeApi.NativeLibrary.GetMainProgramHandle() in /Users/runner/work/node-api-dotnet/node-api-dotnet/src/NodeApi/Native/NativeLibrary.cs:line 35
   at Microsoft.JavaScript.NodeApi.JSNativeApi.Interop.Initialize(IntPtr libraryHandle) in /Users/runner/work/node-api-dotnet/node-api-dotnet/src/NodeApi/Native/JSNativeApi.Interop.cs:line 31
   at Microsoft.JavaScript.NodeApi.Interop.JSRuntimeContext..ctor(napi_env env) in /Users/runner/work/node-api-dotnet/node-api-dotnet/src/NodeApi/Interop/JSRuntimeContext.cs:line 120
   at Microsoft.JavaScript.NodeApi.JSValueScope..ctor(JSValueScopeType scopeType, napi_env env) in /Users/runner/work/node-api-dotnet/node-api-dotnet/src/NodeApi/JSValueScope.cs:line 94
   at Microsoft.JavaScript.NodeApi.DotNetHost.ManagedHost.InitializeModule(napi_env env, napi_value exports) in /Users/runner/work/node-api-dotnet/node-api-dotnet/src/NodeApi.DotNetHost/ManagedHost.cs:line 204

Full output: /Users/runner/work/node-api-dotnet/node-api-dotnet/out/obj/Release/TestCases/napi-dotnet/net6.0/hosted-complex_types.log
   at Microsoft.JavaScript.NodeApi.Test.TestBuilder.RunNodeTestCase(String jsFilePath, String logFilePath, IDictionary`2 testEnvironmentVariables) in /Users/runner/work/node-api-dotnet/node-api-dotnet/test/TestBuilder.cs:line 274
   at Microsoft.JavaScript.NodeApi.Test.HostedClrTests.Test(String id) in /Users/runner/work/node-api-dotnet/node-api-dotnet/test/HostedClrTests.cs:line 95

Check failure on line 274 in test/TestBuilder.cs

See this annotation in the file changed.

@github-actions github-actions / test results (macos-latest, node18.x, Release)

Microsoft.JavaScript.NodeApi.Test.HostedClrTests ► Test(id: "napi-dotnet/delegates")

Failed test found in:
  test/dotnet6-node18.x-Release/_Mac-1695100558872_2023-09-19_05_19_43.trx
Error:
  Assert.Fail(): Node process exited with code: 134. 
  Unhandled exception. System.DllNotFoundException: Unable to load shared library 'libdl.so' or one of its dependencies. In order to help diagnose loading problems, consider setting the DYLD_PRINT_LIBRARIES environment variable: dlopen(liblibdl.so, 0x0001): tried: 'liblibdl.so' (no such file), '/usr/local/lib/liblibdl.so' (no such file), '/usr/lib/liblibdl.so' (no such file), '/Users/runner/work/node-api-dotnet/node-api-dotnet/out/obj/Release/TestCases/napi-dotnet/net6.0/liblibdl.so' (no such file)
     at Microsoft.JavaScript.NodeApi.NativeLibrary.dlopen1(IntPtr fileName, Int32 flags)
     at Microsoft.JavaScript.NodeApi.NativeLibrary.dlopen(IntPtr fileName, Int32 flags) in /Users/runner/work/node-api-dotnet/node-api-dotnet/src/NodeApi/Native/NativeLibrary.cs:line 98
     at Microsoft.JavaScript.NodeApi.NativeLibrary.GetMainProgramHandle() in /Users/runner/work/node-api-dotnet/node-api-dotnet/src/NodeApi/Native/NativeLibrary.cs:line 35
     at Microsoft.JavaScript.NodeApi.JSNativeApi.Interop.Initialize(IntPtr libraryHandle) in /Users/runner/work/node-api-dotnet/node-api-dotnet/src/NodeApi/Native/JSNativeApi.Interop.cs:line 31
     at Microsoft.JavaScript.NodeApi.Interop.JSRuntimeContext..ctor(napi_env env) in /Users/runner/work/node-api-dotnet/node-api-dotnet/src/NodeApi/Interop/JSRuntimeContext.cs:line 120
     at Microsoft.JavaScript.NodeApi.JSValueScope..ctor(JSValueScopeType scopeType, napi_env env) in /Users/runner/work/node-api-dotnet/node-api-dotnet/src/NodeApi/JSValueScope.cs:line 94
     at Microsoft.JavaScript.NodeApi.DotNetHost.ManagedHost.InitializeModule(napi_env env, napi_value exports) in /Users/runner/work/node-api-dotnet/node-api-dotnet/src/NodeApi.DotNetHost/ManagedHost.cs:line 204
  
  Full output: /Users/runner/work/node-api-dotnet/node-api-dotnet/out/obj/Release/TestCases/napi-dotnet/net6.0/hosted-delegates.log
Raw output
Assert.Fail(): Node process exited with code: 134. 
Unhandled exception. System.DllNotFoundException: Unable to load shared library 'libdl.so' or one of its dependencies. In order to help diagnose loading problems, consider setting the DYLD_PRINT_LIBRARIES environment variable: dlopen(liblibdl.so, 0x0001): tried: 'liblibdl.so' (no such file), '/usr/local/lib/liblibdl.so' (no such file), '/usr/lib/liblibdl.so' (no such file), '/Users/runner/work/node-api-dotnet/node-api-dotnet/out/obj/Release/TestCases/napi-dotnet/net6.0/liblibdl.so' (no such file)
   at Microsoft.JavaScript.NodeApi.NativeLibrary.dlopen1(IntPtr fileName, Int32 flags)
   at Microsoft.JavaScript.NodeApi.NativeLibrary.dlopen(IntPtr fileName, Int32 flags) in /Users/runner/work/node-api-dotnet/node-api-dotnet/src/NodeApi/Native/NativeLibrary.cs:line 98
   at Microsoft.JavaScript.NodeApi.NativeLibrary.GetMainProgramHandle() in /Users/runner/work/node-api-dotnet/node-api-dotnet/src/NodeApi/Native/NativeLibrary.cs:line 35
   at Microsoft.JavaScript.NodeApi.JSNativeApi.Interop.Initialize(IntPtr libraryHandle) in /Users/runner/work/node-api-dotnet/node-api-dotnet/src/NodeApi/Native/JSNativeApi.Interop.cs:line 31
   at Microsoft.JavaScript.NodeApi.Interop.JSRuntimeContext..ctor(napi_env env) in /Users/runner/work/node-api-dotnet/node-api-dotnet/src/NodeApi/Interop/JSRuntimeContext.cs:line 120
   at Microsoft.JavaScript.NodeApi.JSValueScope..ctor(JSValueScopeType scopeType, napi_env env) in /Users/runner/work/node-api-dotnet/node-api-dotnet/src/NodeApi/JSValueScope.cs:line 94
   at Microsoft.JavaScript.NodeApi.DotNetHost.ManagedHost.InitializeModule(napi_env env, napi_value exports) in /Users/runner/work/node-api-dotnet/node-api-dotnet/src/NodeApi.DotNetHost/ManagedHost.cs:line 204

Full output: /Users/runner/work/node-api-dotnet/node-api-dotnet/out/obj/Release/TestCases/napi-dotnet/net6.0/hosted-delegates.log
   at Microsoft.JavaScript.NodeApi.Test.TestBuilder.RunNodeTestCase(String jsFilePath, String logFilePath, IDictionary`2 testEnvironmentVariables) in /Users/runner/work/node-api-dotnet/node-api-dotnet/test/TestBuilder.cs:line 274
   at Microsoft.JavaScript.NodeApi.Test.HostedClrTests.Test(String id) in /Users/runner/work/node-api-dotnet/node-api-dotnet/test/HostedClrTests.cs:line 95

Check failure on line 274 in test/TestBuilder.cs

See this annotation in the file changed.

@github-actions github-actions / test results (macos-latest, node18.x, Release)

Microsoft.JavaScript.NodeApi.Test.HostedClrTests ► Test(id: "napi-dotnet/dynamic_generics")

Failed test found in:
  test/dotnet6-node18.x-Release/_Mac-1695100558872_2023-09-19_05_19_43.trx
Error:
  Assert.Fail(): Node process exited with code: 134. 
  Unhandled exception. System.DllNotFoundException: Unable to load shared library 'libdl.so' or one of its dependencies. In order to help diagnose loading problems, consider setting the DYLD_PRINT_LIBRARIES environment variable: dlopen(liblibdl.so, 0x0001): tried: 'liblibdl.so' (no such file), '/usr/local/lib/liblibdl.so' (no such file), '/usr/lib/liblibdl.so' (no such file), '/Users/runner/work/node-api-dotnet/node-api-dotnet/out/obj/Release/TestCases/napi-dotnet/net6.0/liblibdl.so' (no such file)
     at Microsoft.JavaScript.NodeApi.NativeLibrary.dlopen1(IntPtr fileName, Int32 flags)
     at Microsoft.JavaScript.NodeApi.NativeLibrary.dlopen(IntPtr fileName, Int32 flags) in /Users/runner/work/node-api-dotnet/node-api-dotnet/src/NodeApi/Native/NativeLibrary.cs:line 98
     at Microsoft.JavaScript.NodeApi.NativeLibrary.GetMainProgramHandle() in /Users/runner/work/node-api-dotnet/node-api-dotnet/src/NodeApi/Native/NativeLibrary.cs:line 35
     at Microsoft.JavaScript.NodeApi.JSNativeApi.Interop.Initialize(IntPtr libraryHandle) in /Users/runner/work/node-api-dotnet/node-api-dotnet/src/NodeApi/Native/JSNativeApi.Interop.cs:line 31
     at Microsoft.JavaScript.NodeApi.Interop.JSRuntimeContext..ctor(napi_env env) in /Users/runner/work/node-api-dotnet/node-api-dotnet/src/NodeApi/Interop/JSRuntimeContext.cs:line 120
     at Microsoft.JavaScript.NodeApi.JSValueScope..ctor(JSValueScopeType scopeType, napi_env env) in /Users/runner/work/node-api-dotnet/node-api-dotnet/src/NodeApi/JSValueScope.cs:line 94
     at Microsoft.JavaScript.NodeApi.DotNetHost.ManagedHost.InitializeModule(napi_env env, napi_value exports) in /Users/runner/work/node-api-dotnet/node-api-dotnet/src/NodeApi.DotNetHost/ManagedHost.cs:line 204
  
  Full output: /Users/runner/work/node-api-dotnet/node-api-dotnet/out/obj/Release/TestCases/napi-dotnet/net6.0/hosted-dynamic_generics.log
Raw output
Assert.Fail(): Node process exited with code: 134. 
Unhandled exception. System.DllNotFoundException: Unable to load shared library 'libdl.so' or one of its dependencies. In order to help diagnose loading problems, consider setting the DYLD_PRINT_LIBRARIES environment variable: dlopen(liblibdl.so, 0x0001): tried: 'liblibdl.so' (no such file), '/usr/local/lib/liblibdl.so' (no such file), '/usr/lib/liblibdl.so' (no such file), '/Users/runner/work/node-api-dotnet/node-api-dotnet/out/obj/Release/TestCases/napi-dotnet/net6.0/liblibdl.so' (no such file)
   at Microsoft.JavaScript.NodeApi.NativeLibrary.dlopen1(IntPtr fileName, Int32 flags)
   at Microsoft.JavaScript.NodeApi.NativeLibrary.dlopen(IntPtr fileName, Int32 flags) in /Users/runner/work/node-api-dotnet/node-api-dotnet/src/NodeApi/Native/NativeLibrary.cs:line 98
   at Microsoft.JavaScript.NodeApi.NativeLibrary.GetMainProgramHandle() in /Users/runner/work/node-api-dotnet/node-api-dotnet/src/NodeApi/Native/NativeLibrary.cs:line 35
   at Microsoft.JavaScript.NodeApi.JSNativeApi.Interop.Initialize(IntPtr libraryHandle) in /Users/runner/work/node-api-dotnet/node-api-dotnet/src/NodeApi/Native/JSNativeApi.Interop.cs:line 31
   at Microsoft.JavaScript.NodeApi.Interop.JSRuntimeContext..ctor(napi_env env) in /Users/runner/work/node-api-dotnet/node-api-dotnet/src/NodeApi/Interop/JSRuntimeContext.cs:line 120
   at Microsoft.JavaScript.NodeApi.JSValueScope..ctor(JSValueScopeType scopeType, napi_env env) in /Users/runner/work/node-api-dotnet/node-api-dotnet/src/NodeApi/JSValueScope.cs:line 94
   at Microsoft.JavaScript.NodeApi.DotNetHost.ManagedHost.InitializeModule(napi_env env, napi_value exports) in /Users/runner/work/node-api-dotnet/node-api-dotnet/src/NodeApi.DotNetHost/ManagedHost.cs:line 204

Full output: /Users/runner/work/node-api-dotnet/node-api-dotnet/out/obj/Release/TestCases/napi-dotnet/net6.0/hosted-dynamic_generics.log
   at Microsoft.JavaScript.NodeApi.Test.TestBuilder.RunNodeTestCase(String jsFilePath, String logFilePath, IDictionary`2 testEnvironmentVariables) in /Users/runner/work/node-api-dotnet/node-api-dotnet/test/TestBuilder.cs:line 274
   at Microsoft.JavaScript.NodeApi.Test.HostedClrTests.Test(String id) in /Users/runner/work/node-api-dotnet/node-api-dotnet/test/HostedClrTests.cs:line 95

Check failure on line 274 in test/TestBuilder.cs

See this annotation in the file changed.

@github-actions github-actions / test results (macos-latest, node18.x, Release)

Microsoft.JavaScript.NodeApi.Test.HostedClrTests ► Test(id: "napi-dotnet/dynamic_invoke")

Failed test found in:
  test/dotnet6-node18.x-Release/_Mac-1695100558872_2023-09-19_05_19_43.trx
Error:
  Assert.Fail(): Node process exited with code: 134. 
  Unhandled exception. System.DllNotFoundException: Unable to load shared library 'libdl.so' or one of its dependencies. In order to help diagnose loading problems, consider setting the DYLD_PRINT_LIBRARIES environment variable: dlopen(liblibdl.so, 0x0001): tried: 'liblibdl.so' (no such file), '/usr/local/lib/liblibdl.so' (no such file), '/usr/lib/liblibdl.so' (no such file), '/Users/runner/work/node-api-dotnet/node-api-dotnet/out/obj/Release/TestCases/napi-dotnet/net6.0/liblibdl.so' (no such file)
     at Microsoft.JavaScript.NodeApi.NativeLibrary.dlopen1(IntPtr fileName, Int32 flags)
     at Microsoft.JavaScript.NodeApi.NativeLibrary.dlopen(IntPtr fileName, Int32 flags) in /Users/runner/work/node-api-dotnet/node-api-dotnet/src/NodeApi/Native/NativeLibrary.cs:line 98
     at Microsoft.JavaScript.NodeApi.NativeLibrary.GetMainProgramHandle() in /Users/runner/work/node-api-dotnet/node-api-dotnet/src/NodeApi/Native/NativeLibrary.cs:line 35
     at Microsoft.JavaScript.NodeApi.JSNativeApi.Interop.Initialize(IntPtr libraryHandle) in /Users/runner/work/node-api-dotnet/node-api-dotnet/src/NodeApi/Native/JSNativeApi.Interop.cs:line 31
     at Microsoft.JavaScript.NodeApi.Interop.JSRuntimeContext..ctor(napi_env env) in /Users/runner/work/node-api-dotnet/node-api-dotnet/src/NodeApi/Interop/JSRuntimeContext.cs:line 120
     at Microsoft.JavaScript.NodeApi.JSValueScope..ctor(JSValueScopeType scopeType, napi_env env) in /Users/runner/work/node-api-dotnet/node-api-dotnet/src/NodeApi/JSValueScope.cs:line 94
     at Microsoft.JavaScript.NodeApi.DotNetHost.ManagedHost.InitializeModule(napi_env env, napi_value exports) in /Users/runner/work/node-api-dotnet/node-api-dotnet/src/NodeApi.DotNetHost/ManagedHost.cs:line 204
  
  Full output: /Users/runner/work/node-api-dotnet/node-api-dotnet/out/obj/Release/TestCases/napi-dotnet/net6.0/hosted-dynamic_invoke.log
Raw output
Assert.Fail(): Node process exited with code: 134. 
Unhandled exception. System.DllNotFoundException: Unable to load shared library 'libdl.so' or one of its dependencies. In order to help diagnose loading problems, consider setting the DYLD_PRINT_LIBRARIES environment variable: dlopen(liblibdl.so, 0x0001): tried: 'liblibdl.so' (no such file), '/usr/local/lib/liblibdl.so' (no such file), '/usr/lib/liblibdl.so' (no such file), '/Users/runner/work/node-api-dotnet/node-api-dotnet/out/obj/Release/TestCases/napi-dotnet/net6.0/liblibdl.so' (no such file)
   at Microsoft.JavaScript.NodeApi.NativeLibrary.dlopen1(IntPtr fileName, Int32 flags)
   at Microsoft.JavaScript.NodeApi.NativeLibrary.dlopen(IntPtr fileName, Int32 flags) in /Users/runner/work/node-api-dotnet/node-api-dotnet/src/NodeApi/Native/NativeLibrary.cs:line 98
   at Microsoft.JavaScript.NodeApi.NativeLibrary.GetMainProgramHandle() in /Users/runner/work/node-api-dotnet/node-api-dotnet/src/NodeApi/Native/NativeLibrary.cs:line 35
   at Microsoft.JavaScript.NodeApi.JSNativeApi.Interop.Initialize(IntPtr libraryHandle) in /Users/runner/work/node-api-dotnet/node-api-dotnet/src/NodeApi/Native/JSNativeApi.Interop.cs:line 31
   at Microsoft.JavaScript.NodeApi.Interop.JSRuntimeContext..ctor(napi_env env) in /Users/runner/work/node-api-dotnet/node-api-dotnet/src/NodeApi/Interop/JSRuntimeContext.cs:line 120
   at Microsoft.JavaScript.NodeApi.JSValueScope..ctor(JSValueScopeType scopeType, napi_env env) in /Users/runner/work/node-api-dotnet/node-api-dotnet/src/NodeApi/JSValueScope.cs:line 94
   at Microsoft.JavaScript.NodeApi.DotNetHost.ManagedHost.InitializeModule(napi_env env, napi_value exports) in /Users/runner/work/node-api-dotnet/node-api-dotnet/src/NodeApi.DotNetHost/ManagedHost.cs:line 204

Full output: /Users/runner/work/node-api-dotnet/node-api-dotnet/out/obj/Release/TestCases/napi-dotnet/net6.0/hosted-dynamic_invoke.log
   at Microsoft.JavaScript.NodeApi.Test.TestBuilder.RunNodeTestCase(String jsFilePath, String logFilePath, IDictionary`2 testEnvironmentVariables) in /Users/runner/work/node-api-dotnet/node-api-dotnet/test/TestBuilder.cs:line 274
   at Microsoft.JavaScript.NodeApi.Test.HostedClrTests.Test(String id) in /Users/runner/work/node-api-dotnet/node-api-dotnet/test/HostedClrTests.cs:line 95

Check failure on line 274 in test/TestBuilder.cs

See this annotation in the file changed.

@github-actions github-actions / test results (macos-latest, node18.x, Release)

Microsoft.JavaScript.NodeApi.Test.HostedClrTests ► Test(id: "napi-dotnet/dynamic_optional_params")

Failed test found in:
  test/dotnet6-node18.x-Release/_Mac-1695100558872_2023-09-19_05_19_43.trx
Error:
  Assert.Fail(): Node process exited with code: 134. 
  Unhandled exception. System.DllNotFoundException: Unable to load shared library 'libdl.so' or one of its dependencies. In order to help diagnose loading problems, consider setting the DYLD_PRINT_LIBRARIES environment variable: dlopen(liblibdl.so, 0x0001): tried: 'liblibdl.so' (no such file), '/usr/local/lib/liblibdl.so' (no such file), '/usr/lib/liblibdl.so' (no such file), '/Users/runner/work/node-api-dotnet/node-api-dotnet/out/obj/Release/TestCases/napi-dotnet/net6.0/liblibdl.so' (no such file)
     at Microsoft.JavaScript.NodeApi.NativeLibrary.dlopen1(IntPtr fileName, Int32 flags)
     at Microsoft.JavaScript.NodeApi.NativeLibrary.dlopen(IntPtr fileName, Int32 flags) in /Users/runner/work/node-api-dotnet/node-api-dotnet/src/NodeApi/Native/NativeLibrary.cs:line 98
     at Microsoft.JavaScript.NodeApi.NativeLibrary.GetMainProgramHandle() in /Users/runner/work/node-api-dotnet/node-api-dotnet/src/NodeApi/Native/NativeLibrary.cs:line 35
     at Microsoft.JavaScript.NodeApi.JSNativeApi.Interop.Initialize(IntPtr libraryHandle) in /Users/runner/work/node-api-dotnet/node-api-dotnet/src/NodeApi/Native/JSNativeApi.Interop.cs:line 31
     at Microsoft.JavaScript.NodeApi.Interop.JSRuntimeContext..ctor(napi_env env) in /Users/runner/work/node-api-dotnet/node-api-dotnet/src/NodeApi/Interop/JSRuntimeContext.cs:line 120
     at Microsoft.JavaScript.NodeApi.JSValueScope..ctor(JSValueScopeType scopeType, napi_env env) in /Users/runner/work/node-api-dotnet/node-api-dotnet/src/NodeApi/JSValueScope.cs:line 94
     at Microsoft.JavaScript.NodeApi.DotNetHost.ManagedHost.InitializeModule(napi_env env, napi_value exports) in /Users/runner/work/node-api-dotnet/node-api-dotnet/src/NodeApi.DotNetHost/ManagedHost.cs:line 204
  
  Full output: /Users/runner/work/node-api-dotnet/node-api-dotnet/out/obj/Release/TestCases/napi-dotnet/net6.0/hosted-dynamic_optional_params.log
Raw output
Assert.Fail(): Node process exited with code: 134. 
Unhandled exception. System.DllNotFoundException: Unable to load shared library 'libdl.so' or one of its dependencies. In order to help diagnose loading problems, consider setting the DYLD_PRINT_LIBRARIES environment variable: dlopen(liblibdl.so, 0x0001): tried: 'liblibdl.so' (no such file), '/usr/local/lib/liblibdl.so' (no such file), '/usr/lib/liblibdl.so' (no such file), '/Users/runner/work/node-api-dotnet/node-api-dotnet/out/obj/Release/TestCases/napi-dotnet/net6.0/liblibdl.so' (no such file)
   at Microsoft.JavaScript.NodeApi.NativeLibrary.dlopen1(IntPtr fileName, Int32 flags)
   at Microsoft.JavaScript.NodeApi.NativeLibrary.dlopen(IntPtr fileName, Int32 flags) in /Users/runner/work/node-api-dotnet/node-api-dotnet/src/NodeApi/Native/NativeLibrary.cs:line 98
   at Microsoft.JavaScript.NodeApi.NativeLibrary.GetMainProgramHandle() in /Users/runner/work/node-api-dotnet/node-api-dotnet/src/NodeApi/Native/NativeLibrary.cs:line 35
   at Microsoft.JavaScript.NodeApi.JSNativeApi.Interop.Initialize(IntPtr libraryHandle) in /Users/runner/work/node-api-dotnet/node-api-dotnet/src/NodeApi/Native/JSNativeApi.Interop.cs:line 31
   at Microsoft.JavaScript.NodeApi.Interop.JSRuntimeContext..ctor(napi_env env) in /Users/runner/work/node-api-dotnet/node-api-dotnet/src/NodeApi/Interop/JSRuntimeContext.cs:line 120
   at Microsoft.JavaScript.NodeApi.JSValueScope..ctor(JSValueScopeType scopeType, napi_env env) in /Users/runner/work/node-api-dotnet/node-api-dotnet/src/NodeApi/JSValueScope.cs:line 94
   at Microsoft.JavaScript.NodeApi.DotNetHost.ManagedHost.InitializeModule(napi_env env, napi_value exports) in /Users/runner/work/node-api-dotnet/node-api-dotnet/src/NodeApi.DotNetHost/ManagedHost.cs:line 204

Full output: /Users/runner/work/node-api-dotnet/node-api-dotnet/out/obj/Release/TestCases/napi-dotnet/net6.0/hosted-dynamic_optional_params.log
   at Microsoft.JavaScript.NodeApi.Test.TestBuilder.RunNodeTestCase(String jsFilePath, String logFilePath, IDictionary`2 testEnvironmentVariables) in /Users/runner/work/node-api-dotnet/node-api-dotnet/test/TestBuilder.cs:line 274
   at Microsoft.JavaScript.NodeApi.Test.HostedClrTests.Test(String id) in /Users/runner/work/node-api-dotnet/node-api-dotnet/test/HostedClrTests.cs:line 95

Check failure on line 274 in test/TestBuilder.cs

See this annotation in the file changed.

@github-actions github-actions / test results (macos-latest, node18.x, Release)

Microsoft.JavaScript.NodeApi.Test.HostedClrTests ► Test(id: "napi-dotnet/errors")

Failed test found in:
  test/dotnet6-node18.x-Release/_Mac-1695100558872_2023-09-19_05_19_43.trx
Error:
  Assert.Fail(): Node process exited with code: 134. 
  Unhandled exception. System.DllNotFoundException: Unable to load shared library 'libdl.so' or one of its dependencies. In order to help diagnose loading problems, consider setting the DYLD_PRINT_LIBRARIES environment variable: dlopen(liblibdl.so, 0x0001): tried: 'liblibdl.so' (no such file), '/usr/local/lib/liblibdl.so' (no such file), '/usr/lib/liblibdl.so' (no such file), '/Users/runner/work/node-api-dotnet/node-api-dotnet/out/obj/Release/TestCases/napi-dotnet/net6.0/liblibdl.so' (no such file)
     at Microsoft.JavaScript.NodeApi.NativeLibrary.dlopen1(IntPtr fileName, Int32 flags)
     at Microsoft.JavaScript.NodeApi.NativeLibrary.dlopen(IntPtr fileName, Int32 flags) in /Users/runner/work/node-api-dotnet/node-api-dotnet/src/NodeApi/Native/NativeLibrary.cs:line 98
     at Microsoft.JavaScript.NodeApi.NativeLibrary.GetMainProgramHandle() in /Users/runner/work/node-api-dotnet/node-api-dotnet/src/NodeApi/Native/NativeLibrary.cs:line 35
     at Microsoft.JavaScript.NodeApi.JSNativeApi.Interop.Initialize(IntPtr libraryHandle) in /Users/runner/work/node-api-dotnet/node-api-dotnet/src/NodeApi/Native/JSNativeApi.Interop.cs:line 31
     at Microsoft.JavaScript.NodeApi.Interop.JSRuntimeContext..ctor(napi_env env) in /Users/runner/work/node-api-dotnet/node-api-dotnet/src/NodeApi/Interop/JSRuntimeContext.cs:line 120
     at Microsoft.JavaScript.NodeApi.JSValueScope..ctor(JSValueScopeType scopeType, napi_env env) in /Users/runner/work/node-api-dotnet/node-api-dotnet/src/NodeApi/JSValueScope.cs:line 94
     at Microsoft.JavaScript.NodeApi.DotNetHost.ManagedHost.InitializeModule(napi_env env, napi_value exports) in /Users/runner/work/node-api-dotnet/node-api-dotnet/src/NodeApi.DotNetHost/ManagedHost.cs:line 204
  
  Full output: /Users/runner/work/node-api-dotnet/node-api-dotnet/out/obj/Release/TestCases/napi-dotnet/net6.0/hosted-errors.log
Raw output
Assert.Fail(): Node process exited with code: 134. 
Unhandled exception. System.DllNotFoundException: Unable to load shared library 'libdl.so' or one of its dependencies. In order to help diagnose loading problems, consider setting the DYLD_PRINT_LIBRARIES environment variable: dlopen(liblibdl.so, 0x0001): tried: 'liblibdl.so' (no such file), '/usr/local/lib/liblibdl.so' (no such file), '/usr/lib/liblibdl.so' (no such file), '/Users/runner/work/node-api-dotnet/node-api-dotnet/out/obj/Release/TestCases/napi-dotnet/net6.0/liblibdl.so' (no such file)
   at Microsoft.JavaScript.NodeApi.NativeLibrary.dlopen1(IntPtr fileName, Int32 flags)
   at Microsoft.JavaScript.NodeApi.NativeLibrary.dlopen(IntPtr fileName, Int32 flags) in /Users/runner/work/node-api-dotnet/node-api-dotnet/src/NodeApi/Native/NativeLibrary.cs:line 98
   at Microsoft.JavaScript.NodeApi.NativeLibrary.GetMainProgramHandle() in /Users/runner/work/node-api-dotnet/node-api-dotnet/src/NodeApi/Native/NativeLibrary.cs:line 35
   at Microsoft.JavaScript.NodeApi.JSNativeApi.Interop.Initialize(IntPtr libraryHandle) in /Users/runner/work/node-api-dotnet/node-api-dotnet/src/NodeApi/Native/JSNativeApi.Interop.cs:line 31
   at Microsoft.JavaScript.NodeApi.Interop.JSRuntimeContext..ctor(napi_env env) in /Users/runner/work/node-api-dotnet/node-api-dotnet/src/NodeApi/Interop/JSRuntimeContext.cs:line 120
   at Microsoft.JavaScript.NodeApi.JSValueScope..ctor(JSValueScopeType scopeType, napi_env env) in /Users/runner/work/node-api-dotnet/node-api-dotnet/src/NodeApi/JSValueScope.cs:line 94
   at Microsoft.JavaScript.NodeApi.DotNetHost.ManagedHost.InitializeModule(napi_env env, napi_value exports) in /Users/runner/work/node-api-dotnet/node-api-dotnet/src/NodeApi.DotNetHost/ManagedHost.cs:line 204

Full output: /Users/runner/work/node-api-dotnet/node-api-dotnet/out/obj/Release/TestCases/napi-dotnet/net6.0/hosted-errors.log
   at Microsoft.JavaScript.NodeApi.Test.TestBuilder.RunNodeTestCase(String jsFilePath, String logFilePath, IDictionary`2 testEnvironmentVariables) in /Users/runner/work/node-api-dotnet/node-api-dotnet/test/TestBuilder.cs:line 274
   at Microsoft.JavaScript.NodeApi.Test.HostedClrTests.Test(String id) in /Users/runner/work/node-api-dotnet/node-api-dotnet/test/HostedClrTests.cs:line 95

Check failure on line 274 in test/TestBuilder.cs

See this annotation in the file changed.

@github-actions github-actions / test results (macos-latest, node18.x, Release)

Microsoft.JavaScript.NodeApi.Test.HostedClrTests ► Test(id: "napi-dotnet/hello")

Failed test found in:
  test/dotnet6-node18.x-Release/_Mac-1695100558872_2023-09-19_05_19_43.trx
Error:
  Assert.Fail(): Node process exited with code: 134. 
  Unhandled exception. System.DllNotFoundException: Unable to load shared library 'libdl.so' or one of its dependencies. In order to help diagnose loading problems, consider setting the DYLD_PRINT_LIBRARIES environment variable: dlopen(liblibdl.so, 0x0001): tried: 'liblibdl.so' (no such file), '/usr/local/lib/liblibdl.so' (no such file), '/usr/lib/liblibdl.so' (no such file), '/Users/runner/work/node-api-dotnet/node-api-dotnet/out/obj/Release/TestCases/napi-dotnet/net6.0/liblibdl.so' (no such file)
     at Microsoft.JavaScript.NodeApi.NativeLibrary.dlopen1(IntPtr fileName, Int32 flags)
     at Microsoft.JavaScript.NodeApi.NativeLibrary.dlopen(IntPtr fileName, Int32 flags) in /Users/runner/work/node-api-dotnet/node-api-dotnet/src/NodeApi/Native/NativeLibrary.cs:line 98
     at Microsoft.JavaScript.NodeApi.NativeLibrary.GetMainProgramHandle() in /Users/runner/work/node-api-dotnet/node-api-dotnet/src/NodeApi/Native/NativeLibrary.cs:line 35
     at Microsoft.JavaScript.NodeApi.JSNativeApi.Interop.Initialize(IntPtr libraryHandle) in /Users/runner/work/node-api-dotnet/node-api-dotnet/src/NodeApi/Native/JSNativeApi.Interop.cs:line 31
     at Microsoft.JavaScript.NodeApi.Interop.JSRuntimeContext..ctor(napi_env env) in /Users/runner/work/node-api-dotnet/node-api-dotnet/src/NodeApi/Interop/JSRuntimeContext.cs:line 120
     at Microsoft.JavaScript.NodeApi.JSValueScope..ctor(JSValueScopeType scopeType, napi_env env) in /Users/runner/work/node-api-dotnet/node-api-dotnet/src/NodeApi/JSValueScope.cs:line 94
     at Microsoft.JavaScript.NodeApi.DotNetHost.ManagedHost.InitializeModule(napi_env env, napi_value exports) in /Users/runner/work/node-api-dotnet/node-api-dotnet/src/NodeApi.DotNetHost/ManagedHost.cs:line 204
  
  Full output: /Users/runner/work/node-api-dotnet/node-api-dotnet/out/obj/Release/TestCases/napi-dotnet/net6.0/hosted-hello.log
Raw output
Assert.Fail(): Node process exited with code: 134. 
Unhandled exception. System.DllNotFoundException: Unable to load shared library 'libdl.so' or one of its dependencies. In order to help diagnose loading problems, consider setting the DYLD_PRINT_LIBRARIES environment variable: dlopen(liblibdl.so, 0x0001): tried: 'liblibdl.so' (no such file), '/usr/local/lib/liblibdl.so' (no such file), '/usr/lib/liblibdl.so' (no such file), '/Users/runner/work/node-api-dotnet/node-api-dotnet/out/obj/Release/TestCases/napi-dotnet/net6.0/liblibdl.so' (no such file)
   at Microsoft.JavaScript.NodeApi.NativeLibrary.dlopen1(IntPtr fileName, Int32 flags)
   at Microsoft.JavaScript.NodeApi.NativeLibrary.dlopen(IntPtr fileName, Int32 flags) in /Users/runner/work/node-api-dotnet/node-api-dotnet/src/NodeApi/Native/NativeLibrary.cs:line 98
   at Microsoft.JavaScript.NodeApi.NativeLibrary.GetMainProgramHandle() in /Users/runner/work/node-api-dotnet/node-api-dotnet/src/NodeApi/Native/NativeLibrary.cs:line 35
   at Microsoft.JavaScript.NodeApi.JSNativeApi.Interop.Initialize(IntPtr libraryHandle) in /Users/runner/work/node-api-dotnet/node-api-dotnet/src/NodeApi/Native/JSNativeApi.Interop.cs:line 31
   at Microsoft.JavaScript.NodeApi.Interop.JSRuntimeContext..ctor(napi_env env) in /Users/runner/work/node-api-dotnet/node-api-dotnet/src/NodeApi/Interop/JSRuntimeContext.cs:line 120
   at Microsoft.JavaScript.NodeApi.JSValueScope..ctor(JSValueScopeType scopeType, napi_env env) in /Users/runner/work/node-api-dotnet/node-api-dotnet/src/NodeApi/JSValueScope.cs:line 94
   at Microsoft.JavaScript.NodeApi.DotNetHost.ManagedHost.InitializeModule(napi_env env, napi_value exports) in /Users/runner/work/node-api-dotnet/node-api-dotnet/src/NodeApi.DotNetHost/ManagedHost.cs:line 204

Full output: /Users/runner/work/node-api-dotnet/node-api-dotnet/out/obj/Release/TestCases/napi-dotnet/net6.0/hosted-hello.log
   at Microsoft.JavaScript.NodeApi.Test.TestBuilder.RunNodeTestCase(String jsFilePath, String logFilePath, IDictionary`2 testEnvironmentVariables) in /Users/runner/work/node-api-dotnet/node-api-dotnet/test/TestBuilder.cs:line 274
   at Microsoft.JavaScript.NodeApi.Test.HostedClrTests.Test(String id) in /Users/runner/work/node-api-dotnet/node-api-dotnet/test/HostedClrTests.cs:line 95